{"text_format":"1","workbook":"xlsx","n_sheets":2,"sheets":["Kalender","Daten"],"not_rendered":{"charts":0,"images":1,"macros":1,"external_links":0,"defined_names":1,"comments":1,"pivot_tables":0},"unopened":[],"bounds":{"document_bytes":16777216,"sheet_cells":100000,"rows_first":2000,"rows_last":500,"rows_between":2000,"halvings":0,"cell_chars":16384,"cell_head_chars":4096},"cells_cut":0,"cells_raw":0,"read":"whole","date_system":"1900"}

{"sheet":"Kalender","index":0,"n_rows":66,"n_cols":22,"rows_kept":66,"cut":false,"hidden":false,"merged":[[65,12,65,14],[65,15,65,17],[65,0,65,2],[65,3,65,5],[65,6,65,8],[65,9,65,11],[0,0,0,2],[0,3,0,5],[33,0,33,2],[33,3,33,5],[32,0,32,2],[32,3,32,5],[13,20,14,22],[24,19,42,23],[33,6,33,8],[33,9,33,11],[0,6,0,8],[0,9,0,11],[32,6,32,8],[32,9,32,11],[0,12,0,14],[0,15,0,17],[33,12,33,14],[33,15,33,17],[32,12,32,14],[32,15,32,17]]}
[{"$f":"DATE(Daten!$B$1,1,1)","v":"2026-01-01"},null,null,{"$f":"DATE(Daten!$B$1,2,1)","v":"2026-02-01"},null,null,{"$f":"DATE(Daten!$B$1,3,1)","v":"2026-03-01"},null,null,{"$f":"DATE(Daten!$B$1,4,1)","v":"2026-04-01"},null,null,{"$f":"DATE(Daten!$B$1,5,1)","v":"2026-05-01"},null,null,{"$f":"DATE(Daten!$B$1,6,1)","v":"2026-06-01"}]
[1,{"$f":"CHOOSE(WEEKDAY(DATE(Daten!$B$1,1,Kalender!A2)),\"So\",\"Mo\",\"Di\",\"Mi\",\"Do\",\"Fr\",\"Sa\")","v":"Do"},"Neujahr",1,{"$f":"CHOOSE(WEEKDAY(DATE(Daten!$B$1,2,Kalender!D2)),\"So\",\"Mo\",\"Di\",\"Mi\",\"Do\",\"Fr\",\"Sa\")","v":"So"},null,1,{"$f":"CHOOSE(WEEKDAY(DATE(Daten!$B$1,3,Kalender!G2)),\"So\",\"Mo\",\"Di\",\"Mi\",\"Do\",\"Fr\",\"Sa\")","v":"So"},null,1,{"$f":"CHOOSE(WEEKDAY(DATE(Daten!$B$1,4,Kalender!J2)),\"So\",\"Mo\",\"Di\",\"Mi\",\"Do\",\"Fr\",\"Sa\")","v":"Mi"},null,1,{"$f":"CHOOSE(WEEKDAY(DATE(Daten!$B$1,5,Kalender!M2)),\"So\",\"Mo\",\"Di\",\"Mi\",\"Do\",\"Fr\",\"Sa\")","v":"Fr"},"Maifeiertag",1,{"$f":"CHOOSE(WEEKDAY(DATE(Daten!$B$1,6,Kalender!P2)),\"So\",\"Mo\",\"Di\",\"Mi\",\"Do\",\"Fr\",\"Sa\")","v":"Mo"},"KW23"]
[2,{"$f":"CHOOSE(WEEKDAY(DATE(Daten!$B$1,1,Kalender!A3)),\"So\",\"Mo\",\"Di\",\"Mi\",\"Do\",\"Fr\",\"Sa\")","v":"Fr"},null,2,{"$f":"CHOOSE(WEEKDAY(DATE(Daten!$B$1,2,Kalender!D3)),\"So\",\"Mo\",\"Di\",\"Mi\",\"Do\",\"Fr\",\"Sa\")","v":"Mo"},"KW6",2,{"$f":"CHOOSE(WEEKDAY(DATE(Daten!$B$1,3,Kalender!G3)),\"So\",\"Mo\",\"Di\",\"Mi\",\"Do\",\"Fr\",\"Sa\")","v":"Mo"},"KW10",2,{"$f":"CHOOSE(WEEKDAY(DATE(Daten!$B$1,4,Kalender!J3)),\"So\",\"Mo\",\"Di\",\"Mi\",\"Do\",\"Fr\",\"Sa\")","v":"Do"},null,2,{"$f":"CHOOSE(WEEKDAY(DATE(Daten!$B$1,5,Kalender!M3)),\"So\",\"Mo\",\"Di\",\"Mi\",\"Do\",\"Fr\",\"Sa\")","v":"Sa"},null,2,{"$f":"CHOOSE(WEEKDAY(DATE(Daten!$B$1,6,Kalender!P3)),\"So\",\"Mo\",\"Di\",\"Mi\",\"Do\",\"Fr\",\"Sa\")","v":"Di"}]
[3,{"$f":"CHOOSE(WEEKDAY(DATE(Daten!$B$1,1,Kalender!A4)),\"So\",\"Mo\",\"Di\",\"Mi\",\"Do\",\"Fr\",\"Sa\")","v":"Sa"},null,3,{"$f":"CHOOSE(WEEKDAY(DATE(Daten!$B$1,2,Kalender!D4)),\"So\",\"Mo\",\"Di\",\"Mi\",\"Do\",\"Fr\",\"Sa\")","v":"Di"},null,3,{"$f":"CHOOSE(WEEKDAY(DATE(Daten!$B$1,3,Kalender!G4)),\"So\",\"Mo\",\"Di\",\"Mi\",\"Do\",\"Fr\",\"Sa\")","v":"Di"},null,3,{"$f":"CHOOSE(WEEKDAY(DATE(Daten!$B$1,4,Kalender!J4)),\"So\",\"Mo\",\"Di\",\"Mi\",\"Do\",\"Fr\",\"Sa\")","v":"Fr"},"Karfreitag",3,{"$f":"CHOOSE(WEEKDAY(DATE(Daten!$B$1,5,Kalender!M4)),\"So\",\"Mo\",\"Di\",\"Mi\",\"Do\",\"Fr\",\"Sa\")","v":"So"},"Martin B. (70)",3,{"$f":"CHOOSE(WEEKDAY(DATE(Daten!$B$1,6,Kalender!P4)),\"So\",\"Mo\",\"Di\",\"Mi\",\"Do\",\"Fr\",\"Sa\")","v":"Mi"}]
[4,{"$f":"CHOOSE(WEEKDAY(DATE(Daten!$B$1,1,Kalender!A5)),\"So\",\"Mo\",\"Di\",\"Mi\",\"Do\",\"Fr\",\"Sa\")","v":"So"},null,4,{"$f":"CHOOSE(WEEKDAY(DATE(Daten!$B$1,2,Kalender!D5)),\"So\",\"Mo\",\"Di\",\"Mi\",\"Do\",\"Fr\",\"Sa\")","v":"Mi"},null,4,{"$f":"CHOOSE(WEEKDAY(DATE(Daten!$B$1,3,Kalender!G5)),\"So\",\"Mo\",\"Di\",\"Mi\",\"Do\",\"Fr\",\"Sa\")","v":"Mi"},null,4,{"$f":"CHOOSE(WEEKDAY(DATE(Daten!$B$1,4,Kalender!J5)),\"So\",\"Mo\",\"Di\",\"Mi\",\"Do\",\"Fr\",\"Sa\")","v":"Sa"},null,4,{"$f":"CHOOSE(WEEKDAY(DATE(Daten!$B$1,5,Kalender!M5)),\"So\",\"Mo\",\"Di\",\"Mi\",\"Do\",\"Fr\",\"Sa\")","v":"Mo"},"KW19",4,{"$f":"CHOOSE(WEEKDAY(DATE(Daten!$B$1,6,Kalender!P5)),\"So\",\"Mo\",\"Di\",\"Mi\",\"Do\",\"Fr\",\"Sa\")","v":"Do"},"Fronleichnam",null,null,"= Ferien"]
[5,{"$f":"CHOOSE(WEEKDAY(DATE(Daten!$B$1,1,Kalender!A6)),\"So\",\"Mo\",\"Di\",\"Mi\",\"Do\",\"Fr\",\"Sa\")","v":"Mo"},"KW2",5,{"$f":"CHOOSE(WEEKDAY(DATE(Daten!$B$1,2,Kalender!D6)),\"So\",\"Mo\",\"Di\",\"Mi\",\"Do\",\"Fr\",\"Sa\")","v":"Do"},null,5,{"$f":"CHOOSE(WEEKDAY(DATE(Daten!$B$1,3,Kalender!G6)),\"So\",\"Mo\",\"Di\",\"Mi\",\"Do\",\"Fr\",\"Sa\")","v":"Do"},null,5,{"$f":"CHOOSE(WEEKDAY(DATE(Daten!$B$1,4,Kalender!J6)),\"So\",\"Mo\",\"Di\",\"Mi\",\"Do\",\"Fr\",\"Sa\")","v":"So"},"Ostersonntag",5,{"$f":"CHOOSE(WEEKDAY(DATE(Daten!$B$1,5,Kalender!M6)),\"So\",\"Mo\",\"Di\",\"Mi\",\"Do\",\"Fr\",\"Sa\")","v":"Di"},null,5,{"$f":"CHOOSE(WEEKDAY(DATE(Daten!$B$1,6,Kalender!P6)),\"So\",\"Mo\",\"Di\",\"Mi\",\"Do\",\"Fr\",\"Sa\")","v":"Fr"},null,null,null,"kann durch doppelklick"]
[6,{"$f":"CHOOSE(WEEKDAY(DATE(Daten!$B$1,1,Kalender!A7)),\"So\",\"Mo\",\"Di\",\"Mi\",\"Do\",\"Fr\",\"Sa\")","v":"Di"},"Heilige Drei Könige",6,{"$f":"CHOOSE(WEEKDAY(DATE(Daten!$B$1,2,Kalender!D7)),\"So\",\"Mo\",\"Di\",\"Mi\",\"Do\",\"Fr\",\"Sa\")","v":"Fr"},null,6,{"$f":"CHOOSE(WEEKDAY(DATE(Daten!$B$1,3,Kalender!G7)),\"So\",\"Mo\",\"Di\",\"Mi\",\"Do\",\"Fr\",\"Sa\")","v":"Fr"},"Marco B. (45)",6,{"$f":"CHOOSE(WEEKDAY(DATE(Daten!$B$1,4,Kalender!J7)),\"So\",\"Mo\",\"Di\",\"Mi\",\"Do\",\"Fr\",\"Sa\")","v":"Mo"},"Ostermontag, KW15",6,{"$f":"CHOOSE(WEEKDAY(DATE(Daten!$B$1,5,Kalender!M7)),\"So\",\"Mo\",\"Di\",\"Mi\",\"Do\",\"Fr\",\"Sa\")","v":"Mi"},null,6,{"$f":"CHOOSE(WEEKDAY(DATE(Daten!$B$1,6,Kalender!P7)),\"So\",\"Mo\",\"Di\",\"Mi\",\"Do\",\"Fr\",\"Sa\")","v":"Sa"},null,null,null,"ausgeführt werden!"]
[7,{"$f":"CHOOSE(WEEKDAY(DATE(Daten!$B$1,1,Kalender!A8)),\"So\",\"Mo\",\"Di\",\"Mi\",\"Do\",\"Fr\",\"Sa\")","v":"Mi"},null,7,{"$f":"CHOOSE(WEEKDAY(DATE(Daten!$B$1,2,Kalender!D8)),\"So\",\"Mo\",\"Di\",\"Mi\",\"Do\",\"Fr\",\"Sa\")","v":"Sa"},null,7,{"$f":"CHOOSE(WEEKDAY(DATE(Daten!$B$1,3,Kalender!G8)),\"So\",\"Mo\",\"Di\",\"Mi\",\"Do\",\"Fr\",\"Sa\")","v":"Sa"},null,7,{"$f":"CHOOSE(WEEKDAY(DATE(Daten!$B$1,4,Kalender!J8)),\"So\",\"Mo\",\"Di\",\"Mi\",\"Do\",\"Fr\",\"Sa\")","v":"Di"},null,7,{"$f":"CHOOSE(WEEKDAY(DATE(Daten!$B$1,5,Kalender!M8)),\"So\",\"Mo\",\"Di\",\"Mi\",\"Do\",\"Fr\",\"Sa\")","v":"Do"},null,7,{"$f":"CHOOSE(WEEKDAY(DATE(Daten!$B$1,6,Kalender!P8)),\"So\",\"Mo\",\"Di\",\"Mi\",\"Do\",\"Fr\",\"Sa\")","v":"So"}]
[8,{"$f":"CHOOSE(WEEKDAY(DATE(Daten!$B$1,1,Kalender!A9)),\"So\",\"Mo\",\"Di\",\"Mi\",\"Do\",\"Fr\",\"Sa\")","v":"Do"},null,8,{"$f":"CHOOSE(WEEKDAY(DATE(Daten!$B$1,2,Kalender!D9)),\"So\",\"Mo\",\"Di\",\"Mi\",\"Do\",\"Fr\",\"Sa\")","v":"So"},null,8,{"$f":"CHOOSE(WEEKDAY(DATE(Daten!$B$1,3,Kalender!G9)),\"So\",\"Mo\",\"Di\",\"Mi\",\"Do\",\"Fr\",\"Sa\")","v":"So"},null,8,{"$f":"CHOOSE(WEEKDAY(DATE(Daten!$B$1,4,Kalender!J9)),\"So\",\"Mo\",\"Di\",\"Mi\",\"Do\",\"Fr\",\"Sa\")","v":"Mi"},null,8,{"$f":"CHOOSE(WEEKDAY(DATE(Daten!$B$1,5,Kalender!M9)),\"So\",\"Mo\",\"Di\",\"Mi\",\"Do\",\"Fr\",\"Sa\")","v":"Fr"},null,8,{"$f":"CHOOSE(WEEKDAY(DATE(Daten!$B$1,6,Kalender!P9)),\"So\",\"Mo\",\"Di\",\"Mi\",\"Do\",\"Fr\",\"Sa\")","v":"Mo"},"KW24"]
[9,{"$f":"CHOOSE(WEEKDAY(DATE(Daten!$B$1,1,Kalender!A10)),\"So\",\"Mo\",\"Di\",\"Mi\",\"Do\",\"Fr\",\"Sa\")","v":"Fr"},null,9,{"$f":"CHOOSE(WEEKDAY(DATE(Daten!$B$1,2,Kalender!D10)),\"So\",\"Mo\",\"Di\",\"Mi\",\"Do\",\"Fr\",\"Sa\")","v":"Mo"},"KW7",9,{"$f":"CHOOSE(WEEKDAY(DATE(Daten!$B$1,3,Kalender!G10)),\"So\",\"Mo\",\"Di\",\"Mi\",\"Do\",\"Fr\",\"Sa\")","v":"Mo"},"KW11",9,{"$f":"CHOOSE(WEEKDAY(DATE(Daten!$B$1,4,Kalender!J10)),\"So\",\"Mo\",\"Di\",\"Mi\",\"Do\",\"Fr\",\"Sa\")","v":"Do"},null,9,{"$f":"CHOOSE(WEEKDAY(DATE(Daten!$B$1,5,Kalender!M10)),\"So\",\"Mo\",\"Di\",\"Mi\",\"Do\",\"Fr\",\"Sa\")","v":"Sa"},null,9,{"$f":"CHOOSE(WEEKDAY(DATE(Daten!$B$1,6,Kalender!P10)),\"So\",\"Mo\",\"Di\",\"Mi\",\"Do\",\"Fr\",\"Sa\")","v":"Di"}]
[10,{"$f":"CHOOSE(WEEKDAY(DATE(Daten!$B$1,1,Kalender!A11)),\"So\",\"Mo\",\"Di\",\"Mi\",\"Do\",\"Fr\",\"Sa\")","v":"Sa"},null,10,{"$f":"CHOOSE(WEEKDAY(DATE(Daten!$B$1,2,Kalender!D11)),\"So\",\"Mo\",\"Di\",\"Mi\",\"Do\",\"Fr\",\"Sa\")","v":"Di"},null,10,{"$f":"CHOOSE(WEEKDAY(DATE(Daten!$B$1,3,Kalender!G11)),\"So\",\"Mo\",\"Di\",\"Mi\",\"Do\",\"Fr\",\"Sa\")","v":"Di"},null,10,{"$f":"CHOOSE(WEEKDAY(DATE(Daten!$B$1,4,Kalender!J11)),\"So\",\"Mo\",\"Di\",\"Mi\",\"Do\",\"Fr\",\"Sa\")","v":"Fr"},null,10,{"$f":"CHOOSE(WEEKDAY(DATE(Daten!$B$1,5,Kalender!M11)),\"So\",\"Mo\",\"Di\",\"Mi\",\"Do\",\"Fr\",\"Sa\")","v":"So"},"Muttertag",10,{"$f":"CHOOSE(WEEKDAY(DATE(Daten!$B$1,6,Kalender!P11)),\"So\",\"Mo\",\"Di\",\"Mi\",\"Do\",\"Fr\",\"Sa\")","v":"Mi"}]
[11,{"$f":"CHOOSE(WEEKDAY(DATE(Daten!$B$1,1,Kalender!A12)),\"So\",\"Mo\",\"Di\",\"Mi\",\"Do\",\"Fr\",\"Sa\")","v":"So"},null,11,{"$f":"CHOOSE(WEEKDAY(DATE(Daten!$B$1,2,Kalender!D12)),\"So\",\"Mo\",\"Di\",\"Mi\",\"Do\",\"Fr\",\"Sa\")","v":"Mi"},null,11,{"$f":"CHOOSE(WEEKDAY(DATE(Daten!$B$1,3,Kalender!G12)),\"So\",\"Mo\",\"Di\",\"Mi\",\"Do\",\"Fr\",\"Sa\")","v":"Mi"},null,11,{"$f":"CHOOSE(WEEKDAY(DATE(Daten!$B$1,4,Kalender!J12)),\"So\",\"Mo\",\"Di\",\"Mi\",\"Do\",\"Fr\",\"Sa\")","v":"Sa"},null,11,{"$f":"CHOOSE(WEEKDAY(DATE(Daten!$B$1,5,Kalender!M12)),\"So\",\"Mo\",\"Di\",\"Mi\",\"Do\",\"Fr\",\"Sa\")","v":"Mo"},"KW20",11,{"$f":"CHOOSE(WEEKDAY(DATE(Daten!$B$1,6,Kalender!P12)),\"So\",\"Mo\",\"Di\",\"Mi\",\"Do\",\"Fr\",\"Sa\")","v":"Do"}]
[12,{"$f":"CHOOSE(WEEKDAY(DATE(Daten!$B$1,1,Kalender!A13)),\"So\",\"Mo\",\"Di\",\"Mi\",\"Do\",\"Fr\",\"Sa\")","v":"Mo"},"KW3",12,{"$f":"CHOOSE(WEEKDAY(DATE(Daten!$B$1,2,Kalender!D13)),\"So\",\"Mo\",\"Di\",\"Mi\",\"Do\",\"Fr\",\"Sa\")","v":"Do"},"Weiberfasnacht",12,{"$f":"CHOOSE(WEEKDAY(DATE(Daten!$B$1,3,Kalender!G13)),\"So\",\"Mo\",\"Di\",\"Mi\",\"Do\",\"Fr\",\"Sa\")","v":"Do"},null,12,{"$f":"CHOOSE(WEEKDAY(DATE(Daten!$B$1,4,Kalender!J13)),\"So\",\"Mo\",\"Di\",\"Mi\",\"Do\",\"Fr\",\"Sa\")","v":"So"},null,12,{"$f":"CHOOSE(WEEKDAY(DATE(Daten!$B$1,5,Kalender!M13)),\"So\",\"Mo\",\"Di\",\"Mi\",\"Do\",\"Fr\",\"Sa\")","v":"Di"},null,12,{"$f":"CHOOSE(WEEKDAY(DATE(Daten!$B$1,6,Kalender!P13)),\"So\",\"Mo\",\"Di\",\"Mi\",\"Do\",\"Fr\",\"Sa\")","v":"Fr"}]
[13,{"$f":"CHOOSE(WEEKDAY(DATE(Daten!$B$1,1,Kalender!A14)),\"So\",\"Mo\",\"Di\",\"Mi\",\"Do\",\"Fr\",\"Sa\")","v":"Di"},null,13,{"$f":"CHOOSE(WEEKDAY(DATE(Daten!$B$1,2,Kalender!D14)),\"So\",\"Mo\",\"Di\",\"Mi\",\"Do\",\"Fr\",\"Sa\")","v":"Fr"},null,13,{"$f":"CHOOSE(WEEKDAY(DATE(Daten!$B$1,3,Kalender!G14)),\"So\",\"Mo\",\"Di\",\"Mi\",\"Do\",\"Fr\",\"Sa\")","v":"Fr"},null,13,{"$f":"CHOOSE(WEEKDAY(DATE(Daten!$B$1,4,Kalender!J14)),\"So\",\"Mo\",\"Di\",\"Mi\",\"Do\",\"Fr\",\"Sa\")","v":"Mo"},"KW16",13,{"$f":"CHOOSE(WEEKDAY(DATE(Daten!$B$1,5,Kalender!M14)),\"So\",\"Mo\",\"Di\",\"Mi\",\"Do\",\"Fr\",\"Sa\")","v":"Mi"},null,13,{"$f":"CHOOSE(WEEKDAY(DATE(Daten!$B$1,6,Kalender!P14)),\"So\",\"Mo\",\"Di\",\"Mi\",\"Do\",\"Fr\",\"Sa\")","v":"Sa"},null,null,"von Wenm:","Martin Blunschi"]
[14,{"$f":"CHOOSE(WEEKDAY(DATE(Daten!$B$1,1,Kalender!A15)),\"So\",\"Mo\",\"Di\",\"Mi\",\"Do\",\"Fr\",\"Sa\")","v":"Mi"},null,14,{"$f":"CHOOSE(WEEKDAY(DATE(Daten!$B$1,2,Kalender!D15)),\"So\",\"Mo\",\"Di\",\"Mi\",\"Do\",\"Fr\",\"Sa\")","v":"Sa"},null,14,{"$f":"CHOOSE(WEEKDAY(DATE(Daten!$B$1,3,Kalender!G15)),\"So\",\"Mo\",\"Di\",\"Mi\",\"Do\",\"Fr\",\"Sa\")","v":"Sa"},null,14,{"$f":"CHOOSE(WEEKDAY(DATE(Daten!$B$1,4,Kalender!J15)),\"So\",\"Mo\",\"Di\",\"Mi\",\"Do\",\"Fr\",\"Sa\")","v":"Di"},null,14,{"$f":"CHOOSE(WEEKDAY(DATE(Daten!$B$1,5,Kalender!M15)),\"So\",\"Mo\",\"Di\",\"Mi\",\"Do\",\"Fr\",\"Sa\")","v":"Do"},"Christi Himmelfahrt",14,{"$f":"CHOOSE(WEEKDAY(DATE(Daten!$B$1,6,Kalender!P15)),\"So\",\"Mo\",\"Di\",\"Mi\",\"Do\",\"Fr\",\"Sa\")","v":"So"}]
[15,{"$f":"CHOOSE(WEEKDAY(DATE(Daten!$B$1,1,Kalender!A16)),\"So\",\"Mo\",\"Di\",\"Mi\",\"Do\",\"Fr\",\"Sa\")","v":"Do"},null,15,{"$f":"CHOOSE(WEEKDAY(DATE(Daten!$B$1,2,Kalender!D16)),\"So\",\"Mo\",\"Di\",\"Mi\",\"Do\",\"Fr\",\"Sa\")","v":"So"},null,15,{"$f":"CHOOSE(WEEKDAY(DATE(Daten!$B$1,3,Kalender!G16)),\"So\",\"Mo\",\"Di\",\"Mi\",\"Do\",\"Fr\",\"Sa\")","v":"So"},null,15,{"$f":"CHOOSE(WEEKDAY(DATE(Daten!$B$1,4,Kalender!J16)),\"So\",\"Mo\",\"Di\",\"Mi\",\"Do\",\"Fr\",\"Sa\")","v":"Mi"},null,15,{"$f":"CHOOSE(WEEKDAY(DATE(Daten!$B$1,5,Kalender!M16)),\"So\",\"Mo\",\"Di\",\"Mi\",\"Do\",\"Fr\",\"Sa\")","v":"Fr"},null,15,{"$f":"CHOOSE(WEEKDAY(DATE(Daten!$B$1,6,Kalender!P16)),\"So\",\"Mo\",\"Di\",\"Mi\",\"Do\",\"Fr\",\"Sa\")","v":"Mo"},"KW25"]
[16,{"$f":"CHOOSE(WEEKDAY(DATE(Daten!$B$1,1,Kalender!A17)),\"So\",\"Mo\",\"Di\",\"Mi\",\"Do\",\"Fr\",\"Sa\")","v":"Fr"},null,16,{"$f":"CHOOSE(WEEKDAY(DATE(Daten!$B$1,2,Kalender!D17)),\"So\",\"Mo\",\"Di\",\"Mi\",\"Do\",\"Fr\",\"Sa\")","v":"Mo"},"Rosenmontag, KW8",16,{"$f":"CHOOSE(WEEKDAY(DATE(Daten!$B$1,3,Kalender!G17)),\"So\",\"Mo\",\"Di\",\"Mi\",\"Do\",\"Fr\",\"Sa\")","v":"Mo"},"KW12",16,{"$f":"CHOOSE(WEEKDAY(DATE(Daten!$B$1,4,Kalender!J17)),\"So\",\"Mo\",\"Di\",\"Mi\",\"Do\",\"Fr\",\"Sa\")","v":"Do"},null,16,{"$f":"CHOOSE(WEEKDAY(DATE(Daten!$B$1,5,Kalender!M17)),\"So\",\"Mo\",\"Di\",\"Mi\",\"Do\",\"Fr\",\"Sa\")","v":"Sa"},null,16,{"$f":"CHOOSE(WEEKDAY(DATE(Daten!$B$1,6,Kalender!P17)),\"So\",\"Mo\",\"Di\",\"Mi\",\"Do\",\"Fr\",\"Sa\")","v":"Di"}]
[17,{"$f":"CHOOSE(WEEKDAY(DATE(Daten!$B$1,1,Kalender!A18)),\"So\",\"Mo\",\"Di\",\"Mi\",\"Do\",\"Fr\",\"Sa\")","v":"Sa"},null,17,{"$f":"CHOOSE(WEEKDAY(DATE(Daten!$B$1,2,Kalender!D18)),\"So\",\"Mo\",\"Di\",\"Mi\",\"Do\",\"Fr\",\"Sa\")","v":"Di"},null,17,{"$f":"CHOOSE(WEEKDAY(DATE(Daten!$B$1,3,Kalender!G18)),\"So\",\"Mo\",\"Di\",\"Mi\",\"Do\",\"Fr\",\"Sa\")","v":"Di"},null,17,{"$f":"CHOOSE(WEEKDAY(DATE(Daten!$B$1,4,Kalender!J18)),\"So\",\"Mo\",\"Di\",\"Mi\",\"Do\",\"Fr\",\"Sa\")","v":"Fr"},null,17,{"$f":"CHOOSE(WEEKDAY(DATE(Daten!$B$1,5,Kalender!M18)),\"So\",\"Mo\",\"Di\",\"Mi\",\"Do\",\"Fr\",\"Sa\")","v":"So"},null,17,{"$f":"CHOOSE(WEEKDAY(DATE(Daten!$B$1,6,Kalender!P18)),\"So\",\"Mo\",\"Di\",\"Mi\",\"Do\",\"Fr\",\"Sa\")","v":"Mi"}]
[18,{"$f":"CHOOSE(WEEKDAY(DATE(Daten!$B$1,1,Kalender!A19)),\"So\",\"Mo\",\"Di\",\"Mi\",\"Do\",\"Fr\",\"Sa\")","v":"So"},"Mila B. (10)",18,{"$f":"CHOOSE(WEEKDAY(DATE(Daten!$B$1,2,Kalender!D19)),\"So\",\"Mo\",\"Di\",\"Mi\",\"Do\",\"Fr\",\"Sa\")","v":"Mi"},"Aschermittwoch",18,{"$f":"CHOOSE(WEEKDAY(DATE(Daten!$B$1,3,Kalender!G19)),\"So\",\"Mo\",\"Di\",\"Mi\",\"Do\",\"Fr\",\"Sa\")","v":"Mi"},null,18,{"$f":"CHOOSE(WEEKDAY(DATE(Daten!$B$1,4,Kalender!J19)),\"So\",\"Mo\",\"Di\",\"Mi\",\"Do\",\"Fr\",\"Sa\")","v":"Sa"},null,18,{"$f":"CHOOSE(WEEKDAY(DATE(Daten!$B$1,5,Kalender!M19)),\"So\",\"Mo\",\"Di\",\"Mi\",\"Do\",\"Fr\",\"Sa\")","v":"Mo"},"KW21",18,{"$f":"CHOOSE(WEEKDAY(DATE(Daten!$B$1,6,Kalender!P19)),\"So\",\"Mo\",\"Di\",\"Mi\",\"Do\",\"Fr\",\"Sa\")","v":"Do"}]
[19,{"$f":"CHOOSE(WEEKDAY(DATE(Daten!$B$1,1,Kalender!A20)),\"So\",\"Mo\",\"Di\",\"Mi\",\"Do\",\"Fr\",\"Sa\")","v":"Mo"},"KW4",19,{"$f":"CHOOSE(WEEKDAY(DATE(Daten!$B$1,2,Kalender!D20)),\"So\",\"Mo\",\"Di\",\"Mi\",\"Do\",\"Fr\",\"Sa\")","v":"Do"},null,19,{"$f":"CHOOSE(WEEKDAY(DATE(Daten!$B$1,3,Kalender!G20)),\"So\",\"Mo\",\"Di\",\"Mi\",\"Do\",\"Fr\",\"Sa\")","v":"Do"},null,19,{"$f":"CHOOSE(WEEKDAY(DATE(Daten!$B$1,4,Kalender!J20)),\"So\",\"Mo\",\"Di\",\"Mi\",\"Do\",\"Fr\",\"Sa\")","v":"So"},null,19,{"$f":"CHOOSE(WEEKDAY(DATE(Daten!$B$1,5,Kalender!M20)),\"So\",\"Mo\",\"Di\",\"Mi\",\"Do\",\"Fr\",\"Sa\")","v":"Di"},null,19,{"$f":"CHOOSE(WEEKDAY(DATE(Daten!$B$1,6,Kalender!P20)),\"So\",\"Mo\",\"Di\",\"Mi\",\"Do\",\"Fr\",\"Sa\")","v":"Fr"}]
{"$rows_left_out":47}
{"sheet":"Daten","index":1,"n_rows":53,"n_cols":7,"rows_kept":53,"cut":false,"hidden":false,"merged":[[8,6,8,13],[9,6,9,13],[10,6,10,13],[24,3,33,3],[14,3,23,3],[3,3,13,3],[6,6,6,13],[15,6,15,13],[11,6,11,13],[12,6,12,13],[13,6,13,13],[14,6,14,13],[7,6,7,13],[0,6,0,13],[2,6,2,13],[3,6,3,13],[4,6,4,13],[5,6,5,13],[1,6,1,13]]}
["Jahr:",2026,null,null,null,"Arbeitstage: 253","Anleitung:"]
[]
["Datum","Bezeichnung","Farbe","Typ",null,null,"Um einen neuen Kalender zu erstellen, wird in Zelle 'B1' das Jahr eingetragen (wechselpfeil)und das 'START'-Button angewählt."]
[{"$f":"TEXT(IF($E$8-31 < 1,$E$8,$E$8-31),\"0#\")&\".\"&IF($E$8 > 31,\"04.\",\"03.\")&$B$1","v":"05.04.2026"},"Ostersonntag","R","Abhängig von Ostern",{"$f":"INT($B$1/100)","v":20},null,"Es erfolgt eine Abfrage, ob ein neuer Kalender erstellt werden soll, da alle manuellen Einträge im Kalender"]
[{"$f":"IF($A$12=$A$33+14-(WEEKDAY($A$33,2)),-7,0)+$A$33+14-(WEEKDAY($A$33,2))","v":"2026-05-10"},"Muttertag","G",null,null,null,"gelöscht werden. Anschließend wird nebenstehende Liste abgearbeitet, bis das Listenende erreicht wird."]
[{"$f":"$A$4-52","v":"2026-02-12"},"Weiberfasnacht","G",null,{"$f":"MOD(19*MOD($B$1,19)+$E$4-INT($E$4/4)-INT(($E$4-INT(($E$4+8)/25)+1)/3)+15,30)","v":12},null,"Da die gesetzlichen Feiertage in den Bundesländern differieren, müssen mit der Farbe 'R' (rot) in Spalte 'C' die"]
[{"$f":"$A$4-48","v":"2026-02-16"},"Rosenmontag","G",null,{"$f":"MOD(32+2*MOD($E$4,4)+2*INT(MOD($B$1,100)/4)-$E$6-MOD(MOD($B$1,100),4),7)","v":2},null,"Feiertage vorgegeben werden. Alle anderen 'Ereignisse' werden mit 'G' (grün) versehen. Bei der Berechnung der"]
[{"$f":"$A$4-46","v":"2026-02-18"},"Aschermittwoch","G",null,{"$f":"$E$6+$E$7-7*INT((MOD($B$1,19)+11*$E$6+22*$E$7)/451)+22","v":36},null,"Arbeitstage werden die rot eingefärbten Feiertage dann nicht berücksichtigt."]
[{"$f":"$A$4-2","v":"2026-04-03"},"Karfreitag","R"]
[{"$f":"$A$4+1","v":"2026-04-06"},"Ostermontag","R",null,null,null,"Ab Zeile '34' können weitere Ereignisse aufgelistet werden (z.B. Geburtstage), die jedes Jahr am gleichen Tag"]
[{"$f":"$A$4+39","v":"2026-05-14"},"Christi Himmelfahrt","R",null,null,null,"stattfinden. In Spalte 'B' wird die Zeichenkette für den Kalendereintrag eingegeben. Der Eintrag erfolgt in Farbe blau."]
[{"$f":"$A$4+49","v":"2026-05-24"},"Pfingstsonntag","R",null,null,null,"Finden am selben Tag mehrere Ereignisse statt, können diese im Kalendereintrag zusammengefasst werden,"]
[{"$f":"$A$4+50","v":"2026-05-25"},"Pfingstmontag","R",null,null,null,"oder einzeln aufgeführt werden. Es erfolgt automatisch eine Trennung mit Komma. Die Jahreszahl wird zusätzlich"]
[{"$f":"$A$4+60","v":"2026-06-04"},"Fronleichnam","R",null,null,null,"in der Kopfzeile der Seite eingetragen."]
[{"$f":"DATE($B$1,12,25)-WEEKDAY(DATE($B$1,12,25),2)-35","v":"2026-11-15"},"Volkstrauertag","G","Abhängig von Weihnachten"]
[{"$f":"DATE($B$1,12,25)-WEEKDAY(DATE($B$1,12,25),2)-32","v":"2026-11-18"},"Buss- u. Bettag","G",null,null,null,"Wurde der Kalender erstellt, wird das Ergebnis angezeigt und es können nun manuell Termine eingegeben werden."]
[{"$f":"DATE($B$1,12,25)-WEEKDAY(DATE($B$1,12,25),2)-28","v":"2026-11-22"},"Totensonntag","G"]
[{"$f":"DATE($B$1,12,25)-WEEKDAY(DATE($B$1,12,25),2)-21","v":"2026-11-29"},"1. Advent","G"]
[{"$f":"DATE($B$1,12,25)-WEEKDAY(DATE($B$1,12,25),2)-14","v":"2026-12-06"},"2. Advent","G"]
[{"$f":"DATE($B$1,12,25)-WEEKDAY(DATE($B$1,12,25),2)-7","v":"2026-12-13"},"3. Advent","G"]
{"$rows_left_out":33}