{"text_format":"1","workbook":"xlsx","n_sheets":4,"sheets":["Kalender","Feiertage","Mondphasen","Tabelle"],"not_rendered":{"charts":0,"images":2,"macros":1,"external_links":0,"defined_names":6,"comments":0,"pivot_tables":0},"unopened":[],"bounds":{"document_bytes":16777216,"sheet_cells":100000,"rows_first":2000,"rows_last":500,"rows_between":2000,"halvings":0,"cell_chars":16384,"cell_head_chars":4096},"cells_cut":0,"cells_raw":0,"read":"whole","date_system":"1900"}

{"sheet":"Kalender","index":0,"n_rows":34,"n_cols":72,"rows_kept":34,"cut":false,"hidden":false,"merged":[[2,54,2,59],[2,60,2,65],[2,66,2,71],[2,0,2,5],[2,6,2,11],[2,12,2,17],[2,18,2,23],[2,24,2,29],[2,30,2,35],[0,0,0,9],[0,11,0,18],[2,36,2,41],[2,42,2,47],[2,48,2,53],[0,21,0,30]]}
["Kalender",null,null,null,null,null,null,null,null,null,null,2025]
[null,null,{"$f":"NETWORKDAYS(A4,EOMONTH(A4,0),GFT)","v":21},"Arbeitstage",null,null,null,null,{"$f":"NETWORKDAYS(G4,EOMONTH(G4,0),GFT)","v":20},"Arbeitstage",null,null,null,null,{"$f":"NETWORKDAYS(M4,EOMONTH(M4,0),GFT)","v":21},"Arbeitstage",null,null,null,null,{"$f":"NETWORKDAYS(S4,EOMONTH(S4,0),GFT)","v":20},"Arbeitstage",null,null,null,null,{"$f":"NETWORKDAYS(Y4,EOMONTH(Y4,0),GFT)","v":21},"Arbeitstage",null,null,null,null,{"$f":"NETWORKDAYS(AE4,EOMONTH(AE4,0),GFT)","v":20},"Arbeitstage",null,null,null,null,{"$f":"NETWORKDAYS(AK4,EOMONTH(AK4,0),GFT)","v":23},"Arbeitstage",null,null,null,null,{"$f":"NETWORKDAYS(AQ4,EOMONTH(AQ4,0),GFT)","v":20},"Arbeitstage",null,null,null,null,{"$f":"NETWORKDAYS(AW4,EOMONTH(AW4,0),GFT)","v":22},"Arbeitstage",null,null,null,null,{"$f":"NETWORKDAYS(BC4,EOMONTH(BC4,0),GFT)","v":23},"Arbeitstage",null,null,null,null,{"$f":"NETWORKDAYS(BI4,EOMONTH(BI4,0),GFT)","v":20},"Arbeitstage",null,null,null,null,{"$f":"NETWORKDAYS(BO4,EOMONTH(BO4,0),GFT)","v":21},"Arbeitstage"]
["Januar",null,null,null,null,null,"Februar",null,null,null,null,null,"März",null,null,null,null,null,"April",null,null,null,null,null,"Mai",null,null,null,null,null,"Juni",null,null,null,null,null,"Juli",null,null,null,null,null,"August",null,null,null,null,null,"September",null,null,null,null,null,"Oktober",null,null,null,null,null,"November",null,null,null,null,null,"Dezember"]
[{"$f":"IFERROR((ROW()-3&\".\"&A$3&\".\"&$L$1)*1,\"\")","v":"2025-01-01"},{"$f":"IFERROR((ROW()-3&\".\"&A$3&\".\"&$L$1)*1,\"\")","v":45658},{"$f":"A4","v":"2025-01-01"},{"$f":"IFERROR(VLOOKUP(B4,Feiertage!$A$3:$B$29,2,FALSE),\"\")","v":"Neujahr"},{"$f":"IFERROR(VLOOKUP(B4,Mondphasen!$G$23:$H$36,2,FALSE),\"\")","v":""},{"$f":"IFERROR(WEEKNUM(A4,21),\"\")","v":1},{"$f":"IFERROR((ROW()-3&\".\"&G$3&\".\"&$L$1)*1,\"\")","v":"2025-02-01"},{"$f":"IFERROR((ROW()-3&\".\"&G$3&\".\"&$L$1)*1,\"\")","v":45689},{"$f":"G4","v":"2025-02-01"},{"$f":"IFERROR(VLOOKUP(H4,Feiertage!$A$3:$B$29,2,FALSE),\"\")","v":""},{"$f":"IFERROR(VLOOKUP(H4,Mondphasen!$G$23:$H$36,2,FALSE),\"\")","v":""},{"$f":"IFERROR(WEEKNUM(G4,21),\"\")","v":5},{"$f":"IFERROR((ROW()-3&\".\"&M$3&\".\"&$L$1)*1,\"\")","v":"2025-03-01"},{"$f":"IFERROR((ROW()-3&\".\"&M$3&\".\"&$L$1)*1,\"\")","v":45717},{"$f":"M4","v":"2025-03-01"},{"$f":"IFERROR(VLOOKUP(N4,Feiertage!$A$3:$B$29,2,FALSE),\"\")","v":""},{"$f":"IFERROR(VLOOKUP(N4,Mondphasen!$G$23:$H$36,2,FALSE),\"\")","v":""},{"$f":"IFERROR(WEEKNUM(M4,21),\"\")","v":9},{"$f":"IFERROR((ROW()-3&\".\"&S$3&\".\"&$L$1)*1,\"\")","v":"2025-04-01"},{"$f":"IFERROR((ROW()-3&\".\"&S$3&\".\"&$L$1)*1,\"\")","v":45748},{"$f":"S4","v":"2025-04-01"},{"$f":"IFERROR(VLOOKUP(T4,Feiertage!$A$3:$B$29,2,FALSE),\"\")","v":""},{"$f":"IFERROR(VLOOKUP(T4,Mondphasen!$G$23:$H$36,2,FALSE),\"\")","v":""},{"$f":"IFERROR(WEEKNUM(S4,21),\"\")","v":14},{"$f":"IFERROR((ROW()-3&\".\"&Y$3&\".\"&$L$1)*1,\"\")","v":"2025-05-01"},{"$f":"IFERROR((ROW()-3&\".\"&Y$3&\".\"&$L$1)*1,\"\")","v":45778},{"$f":"Y4","v":"2025-05-01"},{"$f":"IFERROR(VLOOKUP(Z4,Feiertage!$A$3:$B$29,2,FALSE),\"\")","v":"Tag der Arbeit"},{"$f":"IFERROR(VLOOKUP(Z4,Mondphasen!$G$23:$H$36,2,FALSE),\"\")","v":""},{"$f":"IFERROR(WEEKNUM(Y4,21),\"\")","v":18},{"$f":"IFERROR((ROW()-3&\".\"&AE$3&\".\"&$L$1)*1,\"\")","v":"2025-06-01"},{"$f":"IFERROR((ROW()-3&\".\"&AE$3&\".\"&$L$1)*1,\"\")","v":45809},{"$f":"AE4","v":"2025-06-01"},{"$f":"IFERROR(VLOOKUP(AF4,Feiertage!$A$3:$B$29,2,FALSE),\"\")","v":""},{"$f":"IFERROR(VLOOKUP(AF4,Mondphasen!$G$23:$H$36,2,FALSE),\"\")","v":""},{"$f":"IFERROR(WEEKNUM(AE4,21),\"\")","v":22},{"$f":"IFERROR((ROW()-3&\".\"&AK$3&\".\"&$L$1)*1,\"\")","v":"2025-07-01"},{"$f":"IFERROR((ROW()-3&\".\"&AK$3&\".\"&$L$1)*1,\"\")","v":45839},{"$f":"AK4","v":"2025-07-01"},{"$f":"IFERROR(VLOOKUP(AL4,Feiertage!$A$3:$B$29,2,FALSE),\"\")","v":""},{"$f":"IFERROR(VLOOKUP(AL4,Mondphasen!$G$23:$H$36,2,FALSE),\"\")","v":""},{"$f":"IFERROR(WEEKNUM(AK4,21),\"\")","v":27},{"$f":"IFERROR((ROW()-3&\".\"&AQ$3&\".\"&$L$1)*1,\"\")","v":"2025-08-01"},{"$f":"IFERROR((ROW()-3&\".\"&AQ$3&\".\"&$L$1)*1,\"\")","v":45870},{"$f":"AQ4","v":"2025-08-01"},{"$f":"IFERROR(VLOOKUP(AR4,Feiertage!$A$3:$B$29,2,FALSE),\"\")","v":"National-Feiertag CH"},{"$f":"IFERROR(VLOOKUP(AR4,Mondphasen!$G$23:$H$36,2,FALSE),\"\")","v":""},{"$f":"IFERROR(WEEKNUM(AQ4,21),\"\")","v":31},{"$f":"IFERROR((ROW()-3&\".\"&AW$3&\".\"&$L$1)*1,\"\")","v":"2025-09-01"},{"$f":"IFERROR((ROW()-3&\".\"&AW$3&\".\"&$L$1)*1,\"\")","v":45901},{"$f":"AW4","v":"2025-09-01"},{"$f":"IFERROR(VLOOKUP(AX4,Feiertage!$A$3:$B$29,2,FALSE),\"\")","v":""},{"$f":"IFERROR(VLOOKUP(AX4,Mondphasen!$G$23:$H$36,2,FALSE),\"\")","v":""},{"$f":"IFERROR(WEEKNUM(AW4,21),\"\")","v":36},{"$f":"IFERROR((ROW()-3&\".\"&BC$3&\".\"&$L$1)*1,\"\")","v":"2025-10-01"},{"$f":"IFERROR((ROW()-3&\".\"&BC$3&\".\"&$L$1)*1,\"\")","v":45931},{"$f":"BC4","v":"2025-10-01"},{"$f":"IFERROR(VLOOKUP(BD4,Feiertage!$A$3:$B$29,2,FALSE),\"\")","v":""},{"$f":"IFERROR(VLOOKUP(BD4,Mondphasen!$G$23:$H$36,2,FALSE),\"\")","v":""},{"$f":"IFERROR(WEEKNUM(BC4,21),\"\")","v":40},{"$f":"IFERROR((ROW()-3&\".\"&BI$3&\".\"&$L$1)*1,\"\")","v":"2025-11-01"},{"$f":"IFERROR((ROW()-3&\".\"&BI$3&\".\"&$L$1)*1,\"\")","v":45962},{"$f":"BI4","v":"2025-11-01"},{"$f":"IFERROR(VLOOKUP(BJ4,Feiertage!$A$3:$B$29,2,FALSE),\"\")","v":"Allerheiligen"},{"$f":"IFERROR(VLOOKUP(BJ4,Mondphasen!$G$23:$H$36,2,FALSE),\"\")","v":""},{"$f":"IFERROR(WEEKNUM(BI4,21),\"\")","v":44},{"$f":"IFERROR((ROW()-3&\".\"&BO$3&\".\"&$L$1)*1,\"\")","v":"2025-12-01"},{"$f":"IFERROR((ROW()-3&\".\"&BO$3&\".\"&$L$1)*1,\"\")","v":45992},{"$f":"BO4","v":"2025-12-01"},{"$f":"IFERROR(VLOOKUP(BP4,Feiertage!$A$3:$B$29,2,FALSE),\"\")","v":""},{"$f":"IFERROR(VLOOKUP(BP4,Mondphasen!$G$23:$H$36,2,FALSE),\"\")","v":""},{"$f":"IFERROR(WEEKNUM(BO4,21),\"\")","v":49}]
["2025-01-02",45659,{"$f":"A5","v":"2025-01-02"},{"$f":"IFERROR(VLOOKUP(B5,Feiertage!$A$3:$B$29,2,FALSE),\"\")","v":"Berchtoldstag"},{"$f":"IFERROR(VLOOKUP(B5,Mondphasen!$G$23:$H$36,2,FALSE),\"\")","v":""},{"$f":"IFERROR(WEEKNUM(A5,21),\"\")","v":1},"2025-02-02",45690,{"$f":"G5","v":"2025-02-02"},{"$f":"IFERROR(VLOOKUP(H5,Feiertage!$A$3:$B$29,2,FALSE),\"\")","v":""},{"$f":"IFERROR(VLOOKUP(H5,Mondphasen!$G$23:$H$36,2,FALSE),\"\")","v":""},5,"2025-03-02",45718,{"$f":"M5","v":"2025-03-02"},{"$f":"IFERROR(VLOOKUP(N5,Feiertage!$A$3:$B$29,2,FALSE),\"\")","v":""},{"$f":"IFERROR(VLOOKUP(N5,Mondphasen!$G$23:$H$36,2,FALSE),\"\")","v":""},{"$f":"IFERROR(WEEKNUM(M5,21),\"\")","v":9},"2025-04-02",45749,{"$f":"S5","v":"2025-04-02"},{"$f":"IFERROR(VLOOKUP(T5,Feiertage!$A$3:$B$29,2,FALSE),\"\")","v":""},{"$f":"IFERROR(VLOOKUP(T5,Mondphasen!$G$23:$H$36,2,FALSE),\"\")","v":""},14,"2025-05-02",45779,{"$f":"Y5","v":"2025-05-02"},{"$f":"IFERROR(VLOOKUP(Z5,Feiertage!$A$3:$B$29,2,FALSE),\"\")","v":""},{"$f":"IFERROR(VLOOKUP(Z5,Mondphasen!$G$23:$H$36,2,FALSE),\"\")","v":""},18,"2025-06-02",45810,{"$f":"AE5","v":"2025-06-02"},{"$f":"IFERROR(VLOOKUP(AF5,Feiertage!$A$3:$B$29,2,FALSE),\"\")","v":""},{"$f":"IFERROR(VLOOKUP(AF5,Mondphasen!$G$23:$H$36,2,FALSE),\"\")","v":""},23,"2025-07-02",45840,{"$f":"AK5","v":"2025-07-02"},{"$f":"IFERROR(VLOOKUP(AL5,Feiertage!$A$3:$B$29,2,FALSE),\"\")","v":""},{"$f":"IFERROR(VLOOKUP(AL5,Mondphasen!$G$23:$H$36,2,FALSE),\"\")","v":""},27,"2025-08-02",45871,{"$f":"AQ5","v":"2025-08-02"},{"$f":"IFERROR(VLOOKUP(AR5,Feiertage!$A$3:$B$29,2,FALSE),\"\")","v":""},{"$f":"IFERROR(VLOOKUP(AR5,Mondphasen!$G$23:$H$36,2,FALSE),\"\")","v":""},31,"2025-09-02",45902,{"$f":"AW5","v":"2025-09-02"},{"$f":"IFERROR(VLOOKUP(AX5,Feiertage!$A$3:$B$29,2,FALSE),\"\")","v":""},{"$f":"IFERROR(VLOOKUP(AX5,Mondphasen!$G$23:$H$36,2,FALSE),\"\")","v":""},36,"2025-10-02",45932,{"$f":"BC5","v":"2025-10-02"},{"$f":"IFERROR(VLOOKUP(BD5,Feiertage!$A$3:$B$29,2,FALSE),\"\")","v":""},{"$f":"IFERROR(VLOOKUP(BD5,Mondphasen!$G$23:$H$36,2,FALSE),\"\")","v":""},40,"2025-11-02",45963,{"$f":"BI5","v":"2025-11-02"},{"$f":"IFERROR(VLOOKUP(BJ5,Feiertage!$A$3:$B$29,2,FALSE),\"\")","v":""},{"$f":"IFERROR(VLOOKUP(BJ5,Mondphasen!$G$23:$H$36,2,FALSE),\"\")","v":""},44,"2025-12-02",45993,{"$f":"BO5","v":"2025-12-02"},{"$f":"IFERROR(VLOOKUP(BP5,Feiertage!$A$3:$B$29,2,FALSE),\"\")","v":""},{"$f":"IFERROR(VLOOKUP(BP5,Mondphasen!$G$23:$H$36,2,FALSE),\"\")","v":""},{"$f":"IFERROR(WEEKNUM(BO5,21),\"\")","v":49}]
["2025-01-03",45660,"2025-01-03",{"$f":"IFERROR(VLOOKUP(B6,Feiertage!$A$3:$B$29,2,FALSE),\"\")","v":""},{"$f":"IFERROR(VLOOKUP(B6,Mondphasen!$G$23:$H$36,2,FALSE),\"\")","v":""},1,"2025-02-03",45691,"2025-02-03",{"$f":"IFERROR(VLOOKUP(H6,Feiertage!$A$3:$B$29,2,FALSE),\"\")","v":""},{"$f":"IFERROR(VLOOKUP(H6,Mondphasen!$G$23:$H$36,2,FALSE),\"\")","v":""},6,"2025-03-03",45719,"2025-03-03",{"$f":"IFERROR(VLOOKUP(N6,Feiertage!$A$3:$B$29,2,FALSE),\"\")","v":"Fasnacht-Montag"},{"$f":"IFERROR(VLOOKUP(N6,Mondphasen!$G$23:$H$36,2,FALSE),\"\")","v":""},10,"2025-04-03",45750,"2025-04-03",{"$f":"IFERROR(VLOOKUP(T6,Feiertage!$A$3:$B$29,2,FALSE),\"\")","v":""},{"$f":"IFERROR(VLOOKUP(T6,Mondphasen!$G$23:$H$36,2,FALSE),\"\")","v":""},14,"2025-05-03",45780,"2025-05-03",{"$f":"IFERROR(VLOOKUP(Z6,Feiertage!$A$3:$B$29,2,FALSE),\"\")","v":""},{"$f":"IFERROR(VLOOKUP(Z6,Mondphasen!$G$23:$H$36,2,FALSE),\"\")","v":""},18,"2025-06-03",45811,"2025-06-03",{"$f":"IFERROR(VLOOKUP(AF6,Feiertage!$A$3:$B$29,2,FALSE),\"\")","v":""},{"$f":"IFERROR(VLOOKUP(AF6,Mondphasen!$G$23:$H$36,2,FALSE),\"\")","v":""},23,"2025-07-03",45841,"2025-07-03",{"$f":"IFERROR(VLOOKUP(AL6,Feiertage!$A$3:$B$29,2,FALSE),\"\")","v":""},{"$f":"IFERROR(VLOOKUP(AL6,Mondphasen!$G$23:$H$36,2,FALSE),\"\")","v":""},27,"2025-08-03",45872,"2025-08-03",{"$f":"IFERROR(VLOOKUP(AR6,Feiertage!$A$3:$B$29,2,FALSE),\"\")","v":""},{"$f":"IFERROR(VLOOKUP(AR6,Mondphasen!$G$23:$H$36,2,FALSE),\"\")","v":""},31,"2025-09-03",45903,"2025-09-03",{"$f":"IFERROR(VLOOKUP(AX6,Feiertage!$A$3:$B$29,2,FALSE),\"\")","v":""},{"$f":"IFERROR(VLOOKUP(AX6,Mondphasen!$G$23:$H$36,2,FALSE),\"\")","v":""},36,"2025-10-03",45933,"2025-10-03",{"$f":"IFERROR(VLOOKUP(BD6,Feiertage!$A$3:$B$29,2,FALSE),\"\")","v":""},{"$f":"IFERROR(VLOOKUP(BD6,Mondphasen!$G$23:$H$36,2,FALSE),\"\")","v":""},40,"2025-11-03",45964,"2025-11-03",{"$f":"IFERROR(VLOOKUP(BJ6,Feiertage!$A$3:$B$29,2,FALSE),\"\")","v":""},{"$f":"IFERROR(VLOOKUP(BJ6,Mondphasen!$G$23:$H$36,2,FALSE),\"\")","v":""},45,"2025-12-03",45994,"2025-12-03",{"$f":"IFERROR(VLOOKUP(BP6,Feiertage!$A$3:$B$29,2,FALSE),\"\")","v":""},{"$f":"IFERROR(VLOOKUP(BP6,Mondphasen!$G$23:$H$36,2,FALSE),\"\")","v":""},49]
["2025-01-04",45661,"2025-01-04",{"$f":"IFERROR(VLOOKUP(B7,Feiertage!$A$3:$B$29,2,FALSE),\"\")","v":""},{"$f":"IFERROR(VLOOKUP(B7,Mondphasen!$G$23:$H$36,2,FALSE),\"\")","v":""},1,"2025-02-04",45692,"2025-02-04",{"$f":"IFERROR(VLOOKUP(H7,Feiertage!$A$3:$B$29,2,FALSE),\"\")","v":""},{"$f":"IFERROR(VLOOKUP(H7,Mondphasen!$G$23:$H$36,2,FALSE),\"\")","v":""},6,"2025-03-04",45720,"2025-03-04",{"$f":"IFERROR(VLOOKUP(N7,Feiertage!$A$3:$B$29,2,FALSE),\"\")","v":"Fasnacht-Dienstag"},{"$f":"IFERROR(VLOOKUP(N7,Mondphasen!$G$23:$H$36,2,FALSE),\"\")","v":""},10,"2025-04-04",45751,"2025-04-04",{"$f":"IFERROR(VLOOKUP(T7,Feiertage!$A$3:$B$29,2,FALSE),\"\")","v":""},{"$f":"IFERROR(VLOOKUP(T7,Mondphasen!$G$23:$H$36,2,FALSE),\"\")","v":""},14,"2025-05-04",45781,"2025-05-04",{"$f":"IFERROR(VLOOKUP(Z7,Feiertage!$A$3:$B$29,2,FALSE),\"\")","v":""},{"$f":"IFERROR(VLOOKUP(Z7,Mondphasen!$G$23:$H$36,2,FALSE),\"\")","v":""},18,"2025-06-04",45812,"2025-06-04",{"$f":"IFERROR(VLOOKUP(AF7,Feiertage!$A$3:$B$29,2,FALSE),\"\")","v":""},{"$f":"IFERROR(VLOOKUP(AF7,Mondphasen!$G$23:$H$36,2,FALSE),\"\")","v":""},23,"2025-07-04",45842,"2025-07-04",{"$f":"IFERROR(VLOOKUP(AL7,Feiertage!$A$3:$B$29,2,FALSE),\"\")","v":""},{"$f":"IFERROR(VLOOKUP(AL7,Mondphasen!$G$23:$H$36,2,FALSE),\"\")","v":""},27,"2025-08-04",45873,"2025-08-04",{"$f":"IFERROR(VLOOKUP(AR7,Feiertage!$A$3:$B$29,2,FALSE),\"\")","v":""},{"$f":"IFERROR(VLOOKUP(AR7,Mondphasen!$G$23:$H$36,2,FALSE),\"\")","v":""},32,"2025-09-04",45904,"2025-09-04",{"$f":"IFERROR(VLOOKUP(AX7,Feiertage!$A$3:$B$29,2,FALSE),\"\")","v":""},{"$f":"IFERROR(VLOOKUP(AX7,Mondphasen!$G$23:$H$36,2,FALSE),\"\")","v":""},36,"2025-10-04",45934,"2025-10-04",{"$f":"IFERROR(VLOOKUP(BD7,Feiertage!$A$3:$B$29,2,FALSE),\"\")","v":""},{"$f":"IFERROR(VLOOKUP(BD7,Mondphasen!$G$23:$H$36,2,FALSE),\"\")","v":""},40,"2025-11-04",45965,"2025-11-04",{"$f":"IFERROR(VLOOKUP(BJ7,Feiertage!$A$3:$B$29,2,FALSE),\"\")","v":""},{"$f":"IFERROR(VLOOKUP(BJ7,Mondphasen!$G$23:$H$36,2,FALSE),\"\")","v":""},45,"2025-12-04",45995,"2025-12-04",{"$f":"IFERROR(VLOOKUP(BP7,Feiertage!$A$3:$B$29,2,FALSE),\"\")","v":""},{"$f":"IFERROR(VLOOKUP(BP7,Mondphasen!$G$23:$H$36,2,FALSE),\"\")","v":""},49]
["2025-01-05",45662,"2025-01-05",{"$f":"IFERROR(VLOOKUP(B8,Feiertage!$A$3:$B$29,2,FALSE),\"\")","v":""},{"$f":"IFERROR(VLOOKUP(B8,Mondphasen!$G$23:$H$36,2,FALSE),\"\")","v":""},1,"2025-02-05",45693,"2025-02-05",{"$f":"IFERROR(VLOOKUP(H8,Feiertage!$A$3:$B$29,2,FALSE),\"\")","v":""},{"$f":"IFERROR(VLOOKUP(H8,Mondphasen!$G$23:$H$36,2,FALSE),\"\")","v":""},6,"2025-03-05",45721,"2025-03-05",{"$f":"IFERROR(VLOOKUP(N8,Feiertage!$A$3:$B$29,2,FALSE),\"\")","v":"Aschermittwoch"},{"$f":"IFERROR(VLOOKUP(N8,Mondphasen!$G$23:$H$36,2,FALSE),\"\")","v":""},10,"2025-04-05",45752,"2025-04-05",{"$f":"IFERROR(VLOOKUP(T8,Feiertage!$A$3:$B$29,2,FALSE),\"\")","v":""},{"$f":"IFERROR(VLOOKUP(T8,Mondphasen!$G$23:$H$36,2,FALSE),\"\")","v":""},14,"2025-05-05",45782,"2025-05-05",{"$f":"IFERROR(VLOOKUP(Z8,Feiertage!$A$3:$B$29,2,FALSE),\"\")","v":""},{"$f":"IFERROR(VLOOKUP(Z8,Mondphasen!$G$23:$H$36,2,FALSE),\"\")","v":""},19,"2025-06-05",45813,"2025-06-05",{"$f":"IFERROR(VLOOKUP(AF8,Feiertage!$A$3:$B$29,2,FALSE),\"\")","v":""},{"$f":"IFERROR(VLOOKUP(AF8,Mondphasen!$G$23:$H$36,2,FALSE),\"\")","v":""},23,"2025-07-05",45843,"2025-07-05",{"$f":"IFERROR(VLOOKUP(AL8,Feiertage!$A$3:$B$29,2,FALSE),\"\")","v":""},{"$f":"IFERROR(VLOOKUP(AL8,Mondphasen!$G$23:$H$36,2,FALSE),\"\")","v":""},27,"2025-08-05",45874,"2025-08-05",{"$f":"IFERROR(VLOOKUP(AR8,Feiertage!$A$3:$B$29,2,FALSE),\"\")","v":""},{"$f":"IFERROR(VLOOKUP(AR8,Mondphasen!$G$23:$H$36,2,FALSE),\"\")","v":""},32,"2025-09-05",45905,"2025-09-05",{"$f":"IFERROR(VLOOKUP(AX8,Feiertage!$A$3:$B$29,2,FALSE),\"\")","v":""},{"$f":"IFERROR(VLOOKUP(AX8,Mondphasen!$G$23:$H$36,2,FALSE),\"\")","v":""},36,"2025-10-05",45935,"2025-10-05",{"$f":"IFERROR(VLOOKUP(BD8,Feiertage!$A$3:$B$29,2,FALSE),\"\")","v":""},{"$f":"IFERROR(VLOOKUP(BD8,Mondphasen!$G$23:$H$36,2,FALSE),\"\")","v":""},40,"2025-11-05",45966,"2025-11-05",{"$f":"IFERROR(VLOOKUP(BJ8,Feiertage!$A$3:$B$29,2,FALSE),\"\")","v":""},{"$f":"IFERROR(VLOOKUP(BJ8,Mondphasen!$G$23:$H$36,2,FALSE),\"\")","v":"l"},45,"2025-12-05",45996,"2025-12-05",{"$f":"IFERROR(VLOOKUP(BP8,Feiertage!$A$3:$B$29,2,FALSE),\"\")","v":""},{"$f":"IFERROR(VLOOKUP(BP8,Mondphasen!$G$23:$H$36,2,FALSE),\"\")","v":"l"},49]
{"$rows_left_out":27}
{"sheet":"Feiertage","index":1,"n_rows":29,"n_cols":16,"rows_kept":29,"cut":false,"hidden":false,"merged":[[1,1,1,3]]}
[{"$f":"IF(COUNTIF($P$3:$P$28,$A$2),\"Schaltjahr\",\"\")","v":""}]
[{"$f":"YEAR(Kalender!A4)","v":2025},{"$f":"A2","v":2025},null,null,"Gesetzlicher\nFeiertag",null,null,null,null,null,null,null,null,null,null,"Schaltjahre"]
[null,null,null,null,null,null,null,null,null,null,null,null,null,null,null,2016]
[{"$f":"C4","v":45658},"Neujahr",{"$f":"DATE(B2,1,1)","v":"2025-01-01"},{"$f":"WEEKDAY(C4,1)","v":"1900-01-04"},"Ja",null,{"$f":"I4","v":45658},"Neujahr",{"$f":"DATE($B$2,1,1)","v":"2025-01-01"},{"$f":"WEEKDAY(I4,1)","v":"1900-01-04"},"Ja",null,null,null,null,{"$f":"P3+4","v":2020}]
[45659,"Berchtoldstag",{"$f":"DATE(B2,1,2)","v":"2025-01-02"},"1900-01-05","Ja",null,45659,"Berchtoldstag",{"$f":"DATE($B$2,1,2)","v":"2025-01-02"},"1900-01-05","Ja",null,null,null,null,{"$f":"P4+4","v":2024}]
[45663,"Heilige drei Könige",{"$f":"DATE(B2,1,6)","v":"2025-01-06"},"1900-01-02",null,null,null,null,null,null,null,null,null,null,null,2028]
[45719,"Fasnacht-Montag",{"$f":"C13-48","v":"2025-03-03"},"1900-01-02",null,null,null,null,null,null,null,null,null,null,null,2032]
[45720,"Fasnacht-Dienstag",{"$f":"C13-47","v":"2025-03-04"},"1900-01-03",null,null,null,null,null,null,null,null,null,null,null,2036]
{"$rows_left_out":22}
{"sheet":"Mondphasen","index":2,"n_rows":36,"n_cols":8,"rows_kept":36,"cut":false,"hidden":false,"merged":[]}
["Jahr : ",{"$f":"Kalender!L1","v":2025}]
["Zeitzone : ",2]
[]
["Neumond"," erstes Viertel","Vollmond","letztes Viertel"]
[{"$f":"Tabelle!H1-2415018.5+Mondphasen!$B$2/24","v":"2024-12-31T00:29:33.340"},{"$f":"Tabelle!H2-2415018.5+Mondphasen!$B$2/24","v":"2025-01-07T01:58:30.509"},{"$f":"Tabelle!H3-2415018.5+Mondphasen!$B$2/24","v":"2025-01-14T00:28:03.460"},{"$f":"Tabelle!H4-2415018.5+Mondphasen!$B$2/24","v":"2025-01-21T22:29:46.106"}]
[{"$f":"Tabelle!H5-2415018.5+Mondphasen!$B$2/24","v":"2025-01-29T14:38:52.321"},{"$f":"Tabelle!H6-2415018.5+Mondphasen!$B$2/24","v":"2025-02-05T10:05:46.114"},{"$f":"Tabelle!H7-2415018.5+Mondphasen!$B$2/24","v":"2025-02-12T15:56:28.619"},{"$f":"Tabelle!H8-2415018.5+Mondphasen!$B$2/24","v":"2025-02-20T19:32:58.370"}]
[{"$f":"Tabelle!H9-2415018.5+Mondphasen!$B$2/24","v":"2025-02-28T02:45:29.318"},{"$f":"Tabelle!H10-2415018.5+Mondphasen!$B$2/24","v":"2025-03-06T18:34:49.193"},{"$f":"Tabelle!H11-2415018.5+Mondphasen!$B$2/24","v":"2025-03-14T08:56:52.486"},{"$f":"Tabelle!H12-2415018.5+Mondphasen!$B$2/24","v":"2025-03-22T13:34:05.249"}]
[{"$f":"Tabelle!H13-2415018.5+Mondphasen!$B$2/24","v":"2025-03-29T12:57:50.390"},{"$f":"Tabelle!H14-2415018.5+Mondphasen!$B$2/24","v":"2025-04-05T04:16:55.303"},{"$f":"Tabelle!H15-2415018.5+Mondphasen!$B$2/24","v":"2025-04-13T02:22:41.046"},{"$f":"Tabelle!H16-2415018.5+Mondphasen!$B$2/24","v":"2025-04-21T03:40:28.997"}]
{"$rows_left_out":29}
{"sheet":"Tabelle","index":3,"n_rows":56,"n_cols":8,"rows_kept":56,"cut":false,"hidden":false,"merged":[]}
[{"$f":"Mondphasen!B1","v":2025},0,{"$f":"INT((A1-2000)*12.3685)+B1","v":309},{"$f":"2451550.09766+29.530588861*C1","v":2460675.0496180491},{"$f":"(2.5534+29.1053567*C1)*PI()/180","v":157.01171529127942},{"$f":"(201.5643+385.81693528*C1)*PI()/180","v":2084.2546923417476},{"$f":"(160.7108+390.67050284*C1)*PI()/180","v":2109.7172811822902},{"$f":"-0.4072*SIN(F1)+0.17241*SIN(E1)+0.01608*SIN(2*F1)+0.01039*SIN(2*G1)+0.00739*SIN(F1-E1)-0.00514*SIN(F1+E1)+0.00208*SIN(2*E1)-0.00111*SIN(F1-2*G1)+D1","v":2460675.4371914379}]
[{"$f":"A1","v":2025},0.25,309.25,2460682.4322652644,157.13871136737498,2085.938136299395,2111.4219028235352,{"$f":"-0.62801*SIN(F2)+0.17172*SIN(E2)-0.01183*SIN(F2+E2)+0.00862*SIN(2*F2)+0.00804*SIN(2*G2)+0.00454*SIN(F2-E2)+0.00204*SIN(2*E2)-0.0018*SIN(F2-2*G2)+D2+0.00306","v":2460682.4989642273}]
[{"$f":"A2","v":2025},0.5,309.5,2460689.8149124794,157.2657074434706,2087.6215802570428,2113.1265244647798,{"$f":"-0.40614*SIN(F3)+0.17302*SIN(E3)+0.01614*SIN(2*F3)+0.01043*SIN(2*G3)+0.00734*SIN(F3-E3)-0.00515*SIN(F3+E3)+0.00209*SIN(2*E3)-0.00111*SIN(F3-2*G3)+D3","v":2460689.4361511618}]
[{"$f":"A3","v":2025},0.75,309.75,2460697.1975596948,157.3927035195662,2089.3050242146901,2114.8311461060248,{"$f":"-0.62801*SIN(F4)+0.17172*SIN(E4)-0.01183*SIN(F4+E4)+0.00862*SIN(2*F4)+0.00804*SIN(2*G4)+0.00454*SIN(F4-E4)+0.00204*SIN(2*E4)-0.0018*SIN(F4-2*G4)+D4-0.00306","v":2460697.3540058518}]
[{"$f":"A1+0.08","v":2025.08},0,310,2460704.5802069101,157.51969959566182,2090.9884681723374,2116.5357677472703,{"$f":"-0.4072*SIN(F5)+0.17241*SIN(E5)+0.01608*SIN(2*F5)+0.01039*SIN(2*G5)+0.00739*SIN(F5-E5)-0.00514*SIN(F5+E5)+0.00208*SIN(2*E5)-0.00111*SIN(F5-2*G5)+D5","v":2460705.0269944561}]
[{"$f":"A5","v":2025.08},0.25,310.25,2460711.9628541251,157.64669567175739,2092.6719121299848,2118.2403893885148,{"$f":"-0.62801*SIN(F6)+0.17172*SIN(E6)-0.01183*SIN(F6+E6)+0.00862*SIN(2*F6)+0.00804*SIN(2*G6)+0.00454*SIN(F6-E6)+0.00204*SIN(2*E6)-0.0018*SIN(F6-2*G6)+D6+0.00306","v":2460711.8373392806}]
[{"$f":"A6","v":2025.08},0.5,310.5,2460719.3455013405,157.77369174785298,2094.3553560876321,2119.9450110297598,{"$f":"-0.40614*SIN(F7)+0.17302*SIN(E7)+0.01614*SIN(2*F7)+0.01043*SIN(2*G7)+0.00734*SIN(F7-E7)-0.00515*SIN(F7+E7)+0.00209*SIN(2*E7)-0.00111*SIN(F7-2*G7)+D7","v":2460719.080886791}]
[{"$f":"A7","v":2025.08},0.75,310.75,2460726.7281485558,157.9006878239486,2096.0388000452799,2121.6496326710048,{"$f":"-0.62801*SIN(F8)+0.17172*SIN(E8)-0.01183*SIN(F8+E8)+0.00862*SIN(2*F8)+0.00804*SIN(2*G8)+0.00454*SIN(F8-E8)+0.00204*SIN(2*E8)-0.0018*SIN(F8-2*G8)+D8-0.00306","v":2460727.2312311362}]
{"$rows_left_out":48}