{"text_format":"1","workbook":"xlsx","n_sheets":4,"sheets":["Kalender","Feiertage","Mondphasen","Tabelle"],"not_rendered":{"charts":0,"images":2,"macros":1,"external_links":0,"defined_names":6,"comments":0,"pivot_tables":0},"unopened":[],"bounds":{"document_bytes":16777216,"sheet_cells":100000,"rows_first":2000,"rows_last":500,"rows_between":2000,"halvings":0,"cell_chars":16384,"cell_head_chars":4096},"cells_cut":0,"cells_raw":0,"read":"whole","date_system":"1900"}

{"sheet":"Kalender","index":0,"n_rows":34,"n_cols":72,"rows_kept":34,"cut":false,"hidden":false,"merged":[[2,54,2,59],[2,60,2,65],[2,66,2,71],[2,0,2,5],[2,6,2,11],[2,12,2,17],[2,18,2,23],[2,24,2,29],[2,30,2,35],[0,0,0,9],[0,11,0,18],[2,36,2,41],[2,42,2,47],[2,48,2,53],[0,21,0,30]]}
["Kalender",null,null,null,null,null,null,null,null,null,null,2025]
[null,null,{"$f":"NETWORKDAYS(A4,EOMONTH(A4,0),GFT)","v":21},"Arbeitstage",null,null,null,null,{"$f":"NETWORKDAYS(G4,EOMONTH(G4,0),GFT)","v":20},"Arbeitstage",null,null,null,null,{"$f":"NETWORKDAYS(M4,EOMONTH(M4,0),GFT)","v":21},"Arbeitstage",null,null,null,null,{"$f":"NETWORKDAYS(S4,EOMONTH(S4,0),GFT)","v":20},"Arbeitstage",null,null,null,null,{"$f":"NETWORKDAYS(Y4,EOMONTH(Y4,0),GFT)","v":21},"Arbeitstage",null,null,null,null,{"$f":"NETWORKDAYS(AE4,EOMONTH(AE4,0),GFT)","v":20},"Arbeitstage",null,null,null,null,{"$f":"NETWORKDAYS(AK4,EOMONTH(AK4,0),GFT)","v":23},"Arbeitstage",null,null,null,null,{"$f":"NETWORKDAYS(AQ4,EOMONTH(AQ4,0),GFT)","v":20},"Arbeitstage",null,null,null,null,{"$f":"NETWORKDAYS(AW4,EOMONTH(AW4,0),GFT)","v":22},"Arbeitstage",null,null,null,null,{"$f":"NETWORKDAYS(BC4,EOMONTH(BC4,0),GFT)","v":23},"Arbeitstage",null,null,null,null,{"$f":"NETWORKDAYS(BI4,EOMONTH(BI4,0),GFT)","v":20},"Arbeitstage",null,null,null,null,{"$f":"NETWORKDAYS(BO4,EOMONTH(BO4,0),GFT)","v":21},"Arbeitstage"]
["Januar",null,null,null,null,null,"Februar",null,null,null,null,null,"März",null,null,null,null,null,"April",null,null,null,null,null,"Mai",null,null,null,null,null,"Juni",null,null,null,null,null,"Juli",null,null,null,null,null,"August",null,null,null,null,null,"September",null,null,null,null,null,"Oktober",null,null,null,null,null,"November",null,null,null,null,null,"Dezember"]
[{"$f":"IFERROR((ROW()-3&\".\"&A$3&\".\"&$L$1)*1,\"\")","v":"2025-01-01"},{"$f":"IFERROR((ROW()-3&\".\"&A$3&\".\"&$L$1)*1,\"\")","v":45658},{"$f":"A4","v":"2025-01-01"},{"$f":"IFERROR(VLOOKUP(B4,Feiertage!$A$3:$B$29,2,FALSE),\"\")","v":"Neujahr"},{"$f":"IFERROR(VLOOKUP(B4,Mondphasen!$G$23:$H$36,2,FALSE),\"\")","v":""},{"$f":"IFERROR(WEEKNUM(A4,21),\"\")","v":1},{"$f":"IFERROR((ROW()-3&\".\"&G$3&\".\"&$L$1)*1,\"\")","v":"2025-02-01"},{"$f":"IFERROR((ROW()-3&\".\"&G$3&\".\"&$L$1)*1,\"\")","v":45689},{"$f":"G4","v":"2025-02-01"},{"$f":"IFERROR(VLOOKUP(H4,Feiertage!$A$3:$B$29,2,FALSE),\"\")","v":""},{"$f":"IFERROR(VLOOKUP(H4,Mondphasen!$G$23:$H$36,2,FALSE),\"\")","v":""},{"$f":"IFERROR(WEEKNUM(G4,21),\"\")","v":5},{"$f":"IFERROR((ROW()-3&\".\"&M$3&\".\"&$L$1)*1,\"\")","v":"2025-03-01"},{"$f":"IFERROR((ROW()-3&\".\"&M$3&\".\"&$L$1)*1,\"\")","v":45717},{"$f":"M4","v":"2025-03-01"},{"$f":"IFERROR(VLOOKUP(N4,Feiertage!$A$3:$B$29,2,FALSE),\"\")","v":""},{"$f":"IFERROR(VLOOKUP(N4,Mondphasen!$G$23:$H$36,2,FALSE),\"\")","v":""},{"$f":"IFERROR(WEEKNUM(M4,21),\"\")","v":9},{"$f":"IFERROR((ROW()-3&\".\"&S$3&\".\"&$L$1)*1,\"\")","v":"2025-04-01"},{"$f":"IFERROR((ROW()-3&\".\"&S$3&\".\"&$L$1)*1,\"\")","v":45748},{"$f":"S4","v":"2025-04-01"},{"$f":"IFERROR(VLOOKUP(T4,Feiertage!$A$3:$B$29,2,FALSE),\"\")","v":""},{"$f":"IFERROR(VLOOKUP(T4,Mondphasen!$G$23:$H$36,2,FALSE),\"\")","v":""},{"$f":"IFERROR(WEEKNUM(S4,21),\"\")","v":14},{"$f":"IFERROR((ROW()-3&\".\"&Y$3&\".\"&$L$1)*1,\"\")","v":"2025-05-01"},{"$f":"IFERROR((ROW()-3&\".\"&Y$3&\".\"&$L$1)*1,\"\")","v":45778},{"$f":"Y4","v":"2025-05-01"},{"$f":"IFERROR(VLOOKUP(Z4,Feiertage!$A$3:$B$29,2,FALSE),\"\")","v":"Tag der Arbeit"},{"$f":"IFERROR(VLOOKUP(Z4,Mondphasen!$G$23:$H$36,2,FALSE),\"\")","v":""},{"$f":"IFERROR(WEEKNUM(Y4,21),\"\")","v":18},{"$f":"IFERROR((ROW()-3&\".\"&AE$3&\".\"&$L$1)*1,\"\")","v":"2025-06-01"},{"$f":"IFERROR((ROW()-3&\".\"&AE$3&\".\"&$L$1)*1,\"\")","v":45809},{"$f":"AE4","v":"2025-06-01"},{"$f":"IFERROR(VLOOKUP(AF4,Feiertage!$A$3:$B$29,2,FALSE),\"\")","v":""},{"$f":"IFERROR(VLOOKUP(AF4,Mondphasen!$G$23:$H$36,2,FALSE),\"\")","v":""},{"$f":"IFERROR(WEEKNUM(AE4,21),\"\")","v":22},{"$f":"IFERROR((ROW()-3&\".\"&AK$3&\".\"&$L$1)*1,\"\")","v":"2025-07-01"},{"$f":"IFERROR((ROW()-3&\".\"&AK$3&\".\"&$L$1)*1,\"\")","v":45839},{"$f":"AK4","v":"2025-07-01"},{"$f":"IFERROR(VLOOKUP(AL4,Feiertage!$A$3:$B$29,2,FALSE),\"\")","v":""},{"$f":"IFERROR(VLOOKUP(AL4,Mondphasen!$G$23:$H$36,2,FALSE),\"\")","v":""},{"$f":"IFERROR(WEEKNUM(AK4,21),\"\")","v":27},{"$f":"IFERROR((ROW()-3&\".\"&AQ$3&\".\"&$L$1)*1,\"\")","v":"2025-08-01"},{"$f":"IFERROR((ROW()-3&\".\"&AQ$3&\".\"&$L$1)*1,\"\")","v":45870},{"$f":"AQ4","v":"2025-08-01"},{"$f":"IFERROR(VLOOKUP(AR4,Feiertage!$A$3:$B$29,2,FALSE),\"\")","v":"National-Feiertag CH"},{"$f":"IFERROR(VLOOKUP(AR4,Mondphasen!$G$23:$H$36,2,FALSE),\"\")","v":""},{"$f":"IFERROR(WEEKNUM(AQ4,21),\"\")","v":31},{"$f":"IFERROR((ROW()-3&\".\"&AW$3&\".\"&$L$1)*1,\"\")","v":"2025-09-01"},{"$f":"IFERROR((ROW()-3&\".\"&AW$3&\".\"&$L$1)*1,\"\")","v":45901},{"$f":"AW4","v":"2025-09-01"},{"$f":"IFERROR(VLOOKUP(AX4,Feiertage!$A$3:$B$29,2,FALSE),\"\")","v":""},{"$f":"IFERROR(VLOOKUP(AX4,Mondphasen!$G$23:$H$36,2,FALSE),\"\")","v":""},{"$f":"IFERROR(WEEKNUM(AW4,21),\"\")","v":36},{"$f":"IFERROR((ROW()-3&\".\"&BC$3&\".\"&$L$1)*1,\"\")","v":"2025-10-01"},{"$f":"IFERROR((ROW()-3&\".\"&BC$3&\".\"&$L$1)*1,\"\")","v":45931},{"$f":"BC4","v":"2025-10-01"},{"$f":"IFERROR(VLOOKUP(BD4,Feiertage!$A$3:$B$29,2,FALSE),\"\")","v":""},{"$f":"IFERROR(VLOOKUP(BD4,Mondphasen!$G$23:$H$36,2,FALSE),\"\")","v":""},{"$f":"IFERROR(WEEKNUM(BC4,21),\"\")","v":40},{"$f":"IFERROR((ROW()-3&\".\"&BI$3&\".\"&$L$1)*1,\"\")","v":"2025-11-01"},{"$f":"IFERROR((ROW()-3&\".\"&BI$3&\".\"&$L$1)*1,\"\")","v":45962},{"$f":"BI4","v":"2025-11-01"},{"$f":"IFERROR(VLOOKUP(BJ4,Feiertage!$A$3:$B$29,2,FALSE),\"\")","v":"Allerheiligen"},{"$f":"IFERROR(VLOOKUP(BJ4,Mondphasen!$G$23:$H$36,2,FALSE),\"\")","v":""},{"$f":"IFERROR(WEEKNUM(BI4,21),\"\")","v":44},{"$f":"IFERROR((ROW()-3&\".\"&BO$3&\".\"&$L$1)*1,\"\")","v":"2025-12-01"},{"$f":"IFERROR((ROW()-3&\".\"&BO$3&\".\"&$L$1)*1,\"\")","v":45992},{"$f":"BO4","v":"2025-12-01"},{"$f":"IFERROR(VLOOKUP(BP4,Feiertage!$A$3:$B$29,2,FALSE),\"\")","v":""},{"$f":"IFERROR(VLOOKUP(BP4,Mondphasen!$G$23:$H$36,2,FALSE),\"\")","v":""},{"$f":"IFERROR(WEEKNUM(BO4,21),\"\")","v":49}]
["2025-01-02",45659,{"$f":"A5","v":"2025-01-02"},{"$f":"IFERROR(VLOOKUP(B5,Feiertage!$A$3:$B$29,2,FALSE),\"\")","v":"Berchtoldstag"},{"$f":"IFERROR(VLOOKUP(B5,Mondphasen!$G$23:$H$36,2,FALSE),\"\")","v":""},{"$f":"IFERROR(WEEKNUM(A5,21),\"\")","v":1},"2025-02-02",45690,{"$f":"G5","v":"2025-02-02"},{"$f":"IFERROR(VLOOKUP(H5,Feiertage!$A$3:$B$29,2,FALSE),\"\")","v":""},{"$f":"IFERROR(VLOOKUP(H5,Mondphasen!$G$23:$H$36,2,FALSE),\"\")","v":""},5,"2025-03-02",45718,{"$f":"M5","v":"2025-03-02"},{"$f":"IFERROR(VLOOKUP(N5,Feiertage!$A$3:$B$29,2,FALSE),\"\")","v":""},{"$f":"IFERROR(VLOOKUP(N5,Mondphasen!$G$23:$H$36,2,FALSE),\"\")","v":""},{"$f":"IFERROR(WEEKNUM(M5,21),\"\")","v":9},"2025-04-02",45749,{"$f":"S5","v":"2025-04-02"},{"$f":"IFERROR(VLOOKUP(T5,Feiertage!$A$3:$B$29,2,FALSE),\"\")","v":""},{"$f":"IFERROR(VLOOKUP(T5,Mondphasen!$G$23:$H$36,2,FALSE),\"\")","v":""},14,"2025-05-02",45779,{"$f":"Y5","v":"2025-05-02"},{"$f":"IFERROR(VLOOKUP(Z5,Feiertage!$A$3:$B$29,2,FALSE),\"\")","v":""},{"$f":"IFERROR(VLOOKUP(Z5,Mondphasen!$G$23:$H$36,2,FALSE),\"\")","v":""},18,"2025-06-02",45810,{"$f":"AE5","v":"2025-06-02"},{"$f":"IFERROR(VLOOKUP(AF5,Feiertage!$A$3:$B$29,2,FALSE),\"\")","v":""},{"$f":"IFERROR(VLOOKUP(AF5,Mondphasen!$G$23:$H$36,2,FALSE),\"\")","v":""},23,"2025-07-02",45840,{"$f":"AK5","v":"2025-07-02"},{"$f":"IFERROR(VLOOKUP(AL5,Feiertage!$A$3:$B$29,2,FALSE),\"\")","v":""},{"$f":"IFERROR(VLOOKUP(AL5,Mondphasen!$G$23:$H$36,2,FALSE),\"\")","v":""},27,"2025-08-02",45871,{"$f":"AQ5","v":"2025-08-02"},{"$f":"IFERROR(VLOOKUP(AR5,Feiertage!$A$3:$B$29,2,FALSE),\"\")","v":""},{"$f":"IFERROR(VLOOKUP(AR5,Mondphasen!$G$23:$H$36,2,FALSE),\"\")","v":""},31,"2025-09-02",45902,{"$f":"AW5","v":"2025-09-02"},{"$f":"IFERROR(VLOOKUP(AX5,Feiertage!$A$3:$B$29,2,FALSE),\"\")","v":""},{"$f":"IFERROR(VLOOKUP(AX5,Mondphasen!$G$23:$H$36,2,FALSE),\"\")","v":""},36,"2025-10-02",45932,{"$f":"BC5","v":"2025-10-02"},{"$f":"IFERROR(VLOOKUP(BD5,Feiertage!$A$3:$B$29,2,FALSE),\"\")","v":""},{"$f":"IFERROR(VLOOKUP(BD5,Mondphasen!$G$23:$H$36,2,FALSE),\"\")","v":""},40,"2025-11-02",45963,{"$f":"BI5","v":"2025-11-02"},{"$f":"IFERROR(VLOOKUP(BJ5,Feiertage!$A$3:$B$29,2,FALSE),\"\")","v":""},{"$f":"IFERROR(VLOOKUP(BJ5,Mondphasen!$G$23:$H$36,2,FALSE),\"\")","v":""},44,"2025-12-02",45993,{"$f":"BO5","v":"2025-12-02"},{"$f":"IFERROR(VLOOKUP(BP5,Feiertage!$A$3:$B$29,2,FALSE),\"\")","v":""},{"$f":"IFERROR(VLOOKUP(BP5,Mondphasen!$G$23:$H$36,2,FALSE),\"\")","v":""},{"$f":"IFERROR(WEEKNUM(BO5,21),\"\")","v":49}]
["2025-01-03",45660,"2025-01-03",{"$f":"IFERROR(VLOOKUP(B6,Feiertage!$A$3:$B$29,2,FALSE),\"\")","v":""},{"$f":"IFERROR(VLOOKUP(B6,Mondphasen!$G$23:$H$36,2,FALSE),\"\")","v":""},1,"2025-02-03",45691,"2025-02-03",{"$f":"IFERROR(VLOOKUP(H6,Feiertage!$A$3:$B$29,2,FALSE),\"\")","v":""},{"$f":"IFERROR(VLOOKUP(H6,Mondphasen!$G$23:$H$36,2,FALSE),\"\")","v":""},6,"2025-03-03",45719,"2025-03-03",{"$f":"IFERROR(VLOOKUP(N6,Feiertage!$A$3:$B$29,2,FALSE),\"\")","v":"Fasnacht-Montag"},{"$f":"IFERROR(VLOOKUP(N6,Mondphasen!$G$23:$H$36,2,FALSE),\"\")","v":""},10,"2025-04-03",45750,"2025-04-03",{"$f":"IFERROR(VLOOKUP(T6,Feiertage!$A$3:$B$29,2,FALSE),\"\")","v":""},{"$f":"IFERROR(VLOOKUP(T6,Mondphasen!$G$23:$H$36,2,FALSE),\"\")","v":""},14,"2025-05-03",45780,"2025-05-03",{"$f":"IFERROR(VLOOKUP(Z6,Feiertage!$A$3:$B$29,2,FALSE),\"\")","v":""},{"$f":"IFERROR(VLOOKUP(Z6,Mondphasen!$G$23:$H$36,2,FALSE),\"\")","v":""},18,"2025-06-03",45811,"2025-06-03",{"$f":"IFERROR(VLOOKUP(AF6,Feiertage!$A$3:$B$29,2,FALSE),\"\")","v":""},{"$f":"IFERROR(VLOOKUP(AF6,Mondphasen!$G$23:$H$36,2,FALSE),\"\")","v":""},23,"2025-07-03",45841,"2025-07-03",{"$f":"IFERROR(VLOOKUP(AL6,Feiertage!$A$3:$B$29,2,FALSE),\"\")","v":""},{"$f":"IFERROR(VLOOKUP(AL6,Mondphasen!$G$23:$H$36,2,FALSE),\"\")","v":""},27,"2025-08-03",45872,"2025-08-03",{"$f":"IFERROR(VLOOKUP(AR6,Feiertage!$A$3:$B$29,2,FALSE),\"\")","v":""},{"$f":"IFERROR(VLOOKUP(AR6,Mondphasen!$G$23:$H$36,2,FALSE),\"\")","v":""},31,"2025-09-03",45903,"2025-09-03",{"$f":"IFERROR(VLOOKUP(AX6,Feiertage!$A$3:$B$29,2,FALSE),\"\")","v":""},{"$f":"IFERROR(VLOOKUP(AX6,Mondphasen!$G$23:$H$36,2,FALSE),\"\")","v":""},36,"2025-10-03",45933,"2025-10-03",{"$f":"IFERROR(VLOOKUP(BD6,Feiertage!$A$3:$B$29,2,FALSE),\"\")","v":""},{"$f":"IFERROR(VLOOKUP(BD6,Mondphasen!$G$23:$H$36,2,FALSE),\"\")","v":""},40,"2025-11-03",45964,"2025-11-03",{"$f":"IFERROR(VLOOKUP(BJ6,Feiertage!$A$3:$B$29,2,FALSE),\"\")","v":""},{"$f":"IFERROR(VLOOKUP(BJ6,Mondphasen!$G$23:$H$36,2,FALSE),\"\")","v":""},45,"2025-12-03",45994,"2025-12-03",{"$f":"IFERROR(VLOOKUP(BP6,Feiertage!$A$3:$B$29,2,FALSE),\"\")","v":""},{"$f":"IFERROR(VLOOKUP(BP6,Mondphasen!$G$23:$H$36,2,FALSE),\"\")","v":""},49]
["2025-01-04",45661,"2025-01-04",{"$f":"IFERROR(VLOOKUP(B7,Feiertage!$A$3:$B$29,2,FALSE),\"\")","v":""},{"$f":"IFERROR(VLOOKUP(B7,Mondphasen!$G$23:$H$36,2,FALSE),\"\")","v":""},1,"2025-02-04",45692,"2025-02-04",{"$f":"IFERROR(VLOOKUP(H7,Feiertage!$A$3:$B$29,2,FALSE),\"\")","v":""},{"$f":"IFERROR(VLOOKUP(H7,Mondphasen!$G$23:$H$36,2,FALSE),\"\")","v":""},6,"2025-03-04",45720,"2025-03-04",{"$f":"IFERROR(VLOOKUP(N7,Feiertage!$A$3:$B$29,2,FALSE),\"\")","v":"Fasnacht-Dienstag"},{"$f":"IFERROR(VLOOKUP(N7,Mondphasen!$G$23:$H$36,2,FALSE),\"\")","v":""},10,"2025-04-04",45751,"2025-04-04",{"$f":"IFERROR(VLOOKUP(T7,Feiertage!$A$3:$B$29,2,FALSE),\"\")","v":""},{"$f":"IFERROR(VLOOKUP(T7,Mondphasen!$G$23:$H$36,2,FALSE),\"\")","v":""},14,"2025-05-04",45781,"2025-05-04",{"$f":"IFERROR(VLOOKUP(Z7,Feiertage!$A$3:$B$29,2,FALSE),\"\")","v":""},{"$f":"IFERROR(VLOOKUP(Z7,Mondphasen!$G$23:$H$36,2,FALSE),\"\")","v":""},18,"2025-06-04",45812,"2025-06-04",{"$f":"IFERROR(VLOOKUP(AF7,Feiertage!$A$3:$B$29,2,FALSE),\"\")","v":""},{"$f":"IFERROR(VLOOKUP(AF7,Mondphasen!$G$23:$H$36,2,FALSE),\"\")","v":""},23,"2025-07-04",45842,"2025-07-04",{"$f":"IFERROR(VLOOKUP(AL7,Feiertage!$A$3:$B$29,2,FALSE),\"\")","v":""},{"$f":"IFERROR(VLOOKUP(AL7,Mondphasen!$G$23:$H$36,2,FALSE),\"\")","v":""},27,"2025-08-04",45873,"2025-08-04",{"$f":"IFERROR(VLOOKUP(AR7,Feiertage!$A$3:$B$29,2,FALSE),\"\")","v":""},{"$f":"IFERROR(VLOOKUP(AR7,Mondphasen!$G$23:$H$36,2,FALSE),\"\")","v":""},32,"2025-09-04",45904,"2025-09-04",{"$f":"IFERROR(VLOOKUP(AX7,Feiertage!$A$3:$B$29,2,FALSE),\"\")","v":""},{"$f":"IFERROR(VLOOKUP(AX7,Mondphasen!$G$23:$H$36,2,FALSE),\"\")","v":""},36,"2025-10-04",45934,"2025-10-04",{"$f":"IFERROR(VLOOKUP(BD7,Feiertage!$A$3:$B$29,2,FALSE),\"\")","v":""},{"$f":"IFERROR(VLOOKUP(BD7,Mondphasen!$G$23:$H$36,2,FALSE),\"\")","v":""},40,"2025-11-04",45965,"2025-11-04",{"$f":"IFERROR(VLOOKUP(BJ7,Feiertage!$A$3:$B$29,2,FALSE),\"\")","v":""},{"$f":"IFERROR(VLOOKUP(BJ7,Mondphasen!$G$23:$H$36,2,FALSE),\"\")","v":""},45,"2025-12-04",45995,"2025-12-04",{"$f":"IFERROR(VLOOKUP(BP7,Feiertage!$A$3:$B$29,2,FALSE),\"\")","v":""},{"$f":"IFERROR(VLOOKUP(BP7,Mondphasen!$G$23:$H$36,2,FALSE),\"\")","v":""},49]
["2025-01-05",45662,"2025-01-05",{"$f":"IFERROR(VLOOKUP(B8,Feiertage!$A$3:$B$29,2,FALSE),\"\")","v":""},{"$f":"IFERROR(VLOOKUP(B8,Mondphasen!$G$23:$H$36,2,FALSE),\"\")","v":""},1,"2025-02-05",45693,"2025-02-05",{"$f":"IFERROR(VLOOKUP(H8,Feiertage!$A$3:$B$29,2,FALSE),\"\")","v":""},{"$f":"IFERROR(VLOOKUP(H8,Mondphasen!$G$23:$H$36,2,FALSE),\"\")","v":""},6,"2025-03-05",45721,"2025-03-05",{"$f":"IFERROR(VLOOKUP(N8,Feiertage!$A$3:$B$29,2,FALSE),\"\")","v":"Aschermittwoch"},{"$f":"IFERROR(VLOOKUP(N8,Mondphasen!$G$23:$H$36,2,FALSE),\"\")","v":""},10,"2025-04-05",45752,"2025-04-05",{"$f":"IFERROR(VLOOKUP(T8,Feiertage!$A$3:$B$29,2,FALSE),\"\")","v":""},{"$f":"IFERROR(VLOOKUP(T8,Mondphasen!$G$23:$H$36,2,FALSE),\"\")","v":""},14,"2025-05-05",45782,"2025-05-05",{"$f":"IFERROR(VLOOKUP(Z8,Feiertage!$A$3:$B$29,2,FALSE),\"\")","v":""},{"$f":"IFERROR(VLOOKUP(Z8,Mondphasen!$G$23:$H$36,2,FALSE),\"\")","v":""},19,"2025-06-05",45813,"2025-06-05",{"$f":"IFERROR(VLOOKUP(AF8,Feiertage!$A$3:$B$29,2,FALSE),\"\")","v":""},{"$f":"IFERROR(VLOOKUP(AF8,Mondphasen!$G$23:$H$36,2,FALSE),\"\")","v":""},23,"2025-07-05",45843,"2025-07-05",{"$f":"IFERROR(VLOOKUP(AL8,Feiertage!$A$3:$B$29,2,FALSE),\"\")","v":""},{"$f":"IFERROR(VLOOKUP(AL8,Mondphasen!$G$23:$H$36,2,FALSE),\"\")","v":""},27,"2025-08-05",45874,"2025-08-05",{"$f":"IFERROR(VLOOKUP(AR8,Feiertage!$A$3:$B$29,2,FALSE),\"\")","v":""},{"$f":"IFERROR(VLOOKUP(AR8,Mondphasen!$G$23:$H$36,2,FALSE),\"\")","v":""},32,"2025-09-05",45905,"2025-09-05",{"$f":"IFERROR(VLOOKUP(AX8,Feiertage!$A$3:$B$29,2,FALSE),\"\")","v":""},{"$f":"IFERROR(VLOOKUP(AX8,Mondphasen!$G$23:$H$36,2,FALSE),\"\")","v":""},36,"2025-10-05",45935,"2025-10-05",{"$f":"IFERROR(VLOOKUP(BD8,Feiertage!$A$3:$B$29,2,FALSE),\"\")","v":""},{"$f":"IFERROR(VLOOKUP(BD8,Mondphasen!$G$23:$H$36,2,FALSE),\"\")","v":""},40,"2025-11-05",45966,"2025-11-05",{"$f":"IFERROR(VLOOKUP(BJ8,Feiertage!$A$3:$B$29,2,FALSE),\"\")","v":""},{"$f":"IFERROR(VLOOKUP(BJ8,Mondphasen!$G$23:$H$36,2,FALSE),\"\")","v":"l"},45,"2025-12-05",45996,"2025-12-05",{"$f":"IFERROR(VLOOKUP(BP8,Feiertage!$A$3:$B$29,2,FALSE),\"\")","v":""},{"$f":"IFERROR(VLOOKUP(BP8,Mondphasen!$G$23:$H$36,2,FALSE),\"\")","v":"l"},49]
["2025-01-06",45663,"2025-01-06",{"$f":"IFERROR(VLOOKUP(B9,Feiertage!$A$3:$B$29,2,FALSE),\"\")","v":"Heilige drei Könige"},{"$f":"IFERROR(VLOOKUP(B9,Mondphasen!$G$23:$H$36,2,FALSE),\"\")","v":""},2,"2025-02-06",45694,"2025-02-06",{"$f":"IFERROR(VLOOKUP(H9,Feiertage!$A$3:$B$29,2,FALSE),\"\")","v":""},{"$f":"IFERROR(VLOOKUP(H9,Mondphasen!$G$23:$H$36,2,FALSE),\"\")","v":""},6,"2025-03-06",45722,"2025-03-06",{"$f":"IFERROR(VLOOKUP(N9,Feiertage!$A$3:$B$29,2,FALSE),\"\")","v":""},{"$f":"IFERROR(VLOOKUP(N9,Mondphasen!$G$23:$H$36,2,FALSE),\"\")","v":""},10,"2025-04-06",45753,"2025-04-06",{"$f":"IFERROR(VLOOKUP(T9,Feiertage!$A$3:$B$29,2,FALSE),\"\")","v":""},{"$f":"IFERROR(VLOOKUP(T9,Mondphasen!$G$23:$H$36,2,FALSE),\"\")","v":""},14,"2025-05-06",45783,"2025-05-06",{"$f":"IFERROR(VLOOKUP(Z9,Feiertage!$A$3:$B$29,2,FALSE),\"\")","v":""},{"$f":"IFERROR(VLOOKUP(Z9,Mondphasen!$G$23:$H$36,2,FALSE),\"\")","v":""},19,"2025-06-06",45814,"2025-06-06",{"$f":"IFERROR(VLOOKUP(AF9,Feiertage!$A$3:$B$29,2,FALSE),\"\")","v":""},{"$f":"IFERROR(VLOOKUP(AF9,Mondphasen!$G$23:$H$36,2,FALSE),\"\")","v":""},23,"2025-07-06",45844,"2025-07-06",{"$f":"IFERROR(VLOOKUP(AL9,Feiertage!$A$3:$B$29,2,FALSE),\"\")","v":""},{"$f":"IFERROR(VLOOKUP(AL9,Mondphasen!$G$23:$H$36,2,FALSE),\"\")","v":""},27,"2025-08-06",45875,"2025-08-06",{"$f":"IFERROR(VLOOKUP(AR9,Feiertage!$A$3:$B$29,2,FALSE),\"\")","v":""},{"$f":"IFERROR(VLOOKUP(AR9,Mondphasen!$G$23:$H$36,2,FALSE),\"\")","v":""},32,"2025-09-06",45906,"2025-09-06",{"$f":"IFERROR(VLOOKUP(AX9,Feiertage!$A$3:$B$29,2,FALSE),\"\")","v":""},{"$f":"IFERROR(VLOOKUP(AX9,Mondphasen!$G$23:$H$36,2,FALSE),\"\")","v":""},36,"2025-10-06",45936,"2025-10-06",{"$f":"IFERROR(VLOOKUP(BD9,Feiertage!$A$3:$B$29,2,FALSE),\"\")","v":""},{"$f":"IFERROR(VLOOKUP(BD9,Mondphasen!$G$23:$H$36,2,FALSE),\"\")","v":""},41,"2025-11-06",45967,"2025-11-06",{"$f":"IFERROR(VLOOKUP(BJ9,Feiertage!$A$3:$B$29,2,FALSE),\"\")","v":""},{"$f":"IFERROR(VLOOKUP(BJ9,Mondphasen!$G$23:$H$36,2,FALSE),\"\")","v":""},45,"2025-12-06",45997,"2025-12-06",{"$f":"IFERROR(VLOOKUP(BP9,Feiertage!$A$3:$B$29,2,FALSE),\"\")","v":"Samichlaus"},{"$f":"IFERROR(VLOOKUP(BP9,Mondphasen!$G$23:$H$36,2,FALSE),\"\")","v":""},49]
["2025-01-07",45664,"2025-01-07",{"$f":"IFERROR(VLOOKUP(B10,Feiertage!$A$3:$B$29,2,FALSE),\"\")","v":""},{"$f":"IFERROR(VLOOKUP(B10,Mondphasen!$G$23:$H$36,2,FALSE),\"\")","v":""},2,"2025-02-07",45695,"2025-02-07",{"$f":"IFERROR(VLOOKUP(H10,Feiertage!$A$3:$B$29,2,FALSE),\"\")","v":""},{"$f":"IFERROR(VLOOKUP(H10,Mondphasen!$G$23:$H$36,2,FALSE),\"\")","v":""},6,"2025-03-07",45723,"2025-03-07",{"$f":"IFERROR(VLOOKUP(N10,Feiertage!$A$3:$B$29,2,FALSE),\"\")","v":""},{"$f":"IFERROR(VLOOKUP(N10,Mondphasen!$G$23:$H$36,2,FALSE),\"\")","v":""},10,"2025-04-07",45754,"2025-04-07",{"$f":"IFERROR(VLOOKUP(T10,Feiertage!$A$3:$B$29,2,FALSE),\"\")","v":""},{"$f":"IFERROR(VLOOKUP(T10,Mondphasen!$G$23:$H$36,2,FALSE),\"\")","v":""},15,"2025-05-07",45784,"2025-05-07",{"$f":"IFERROR(VLOOKUP(Z10,Feiertage!$A$3:$B$29,2,FALSE),\"\")","v":""},{"$f":"IFERROR(VLOOKUP(Z10,Mondphasen!$G$23:$H$36,2,FALSE),\"\")","v":""},19,"2025-06-07",45815,"2025-06-07",{"$f":"IFERROR(VLOOKUP(AF10,Feiertage!$A$3:$B$29,2,FALSE),\"\")","v":""},{"$f":"IFERROR(VLOOKUP(AF10,Mondphasen!$G$23:$H$36,2,FALSE),\"\")","v":""},23,"2025-07-07",45845,"2025-07-07",{"$f":"IFERROR(VLOOKUP(AL10,Feiertage!$A$3:$B$29,2,FALSE),\"\")","v":""},{"$f":"IFERROR(VLOOKUP(AL10,Mondphasen!$G$23:$H$36,2,FALSE),\"\")","v":""},28,"2025-08-07",45876,"2025-08-07",{"$f":"IFERROR(VLOOKUP(AR10,Feiertage!$A$3:$B$29,2,FALSE),\"\")","v":""},{"$f":"IFERROR(VLOOKUP(AR10,Mondphasen!$G$23:$H$36,2,FALSE),\"\")","v":""},32,"2025-09-07",45907,"2025-09-07",{"$f":"IFERROR(VLOOKUP(AX10,Feiertage!$A$3:$B$29,2,FALSE),\"\")","v":""},{"$f":"IFERROR(VLOOKUP(AX10,Mondphasen!$G$23:$H$36,2,FALSE),\"\")","v":"l"},36,"2025-10-07",45937,"2025-10-07",{"$f":"IFERROR(VLOOKUP(BD10,Feiertage!$A$3:$B$29,2,FALSE),\"\")","v":""},{"$f":"IFERROR(VLOOKUP(BD10,Mondphasen!$G$23:$H$36,2,FALSE),\"\")","v":"l"},41,"2025-11-07",45968,"2025-11-07",{"$f":"IFERROR(VLOOKUP(BJ10,Feiertage!$A$3:$B$29,2,FALSE),\"\")","v":""},{"$f":"IFERROR(VLOOKUP(BJ10,Mondphasen!$G$23:$H$36,2,FALSE),\"\")","v":""},45,"2025-12-07",45998,"2025-12-07",{"$f":"IFERROR(VLOOKUP(BP10,Feiertage!$A$3:$B$29,2,FALSE),\"\")","v":""},{"$f":"IFERROR(VLOOKUP(BP10,Mondphasen!$G$23:$H$36,2,FALSE),\"\")","v":""},49]
["2025-01-08",45665,"2025-01-08",{"$f":"IFERROR(VLOOKUP(B11,Feiertage!$A$3:$B$29,2,FALSE),\"\")","v":""},{"$f":"IFERROR(VLOOKUP(B11,Mondphasen!$G$23:$H$36,2,FALSE),\"\")","v":""},2,"2025-02-08",45696,"2025-02-08",{"$f":"IFERROR(VLOOKUP(H11,Feiertage!$A$3:$B$29,2,FALSE),\"\")","v":""},{"$f":"IFERROR(VLOOKUP(H11,Mondphasen!$G$23:$H$36,2,FALSE),\"\")","v":""},6,"2025-03-08",45724,"2025-03-08",{"$f":"IFERROR(VLOOKUP(N11,Feiertage!$A$3:$B$29,2,FALSE),\"\")","v":""},{"$f":"IFERROR(VLOOKUP(N11,Mondphasen!$G$23:$H$36,2,FALSE),\"\")","v":""},10,"2025-04-08",45755,"2025-04-08",{"$f":"IFERROR(VLOOKUP(T11,Feiertage!$A$3:$B$29,2,FALSE),\"\")","v":""},{"$f":"IFERROR(VLOOKUP(T11,Mondphasen!$G$23:$H$36,2,FALSE),\"\")","v":""},15,"2025-05-08",45785,"2025-05-08",{"$f":"IFERROR(VLOOKUP(Z11,Feiertage!$A$3:$B$29,2,FALSE),\"\")","v":""},{"$f":"IFERROR(VLOOKUP(Z11,Mondphasen!$G$23:$H$36,2,FALSE),\"\")","v":""},19,"2025-06-08",45816,"2025-06-08",{"$f":"IFERROR(VLOOKUP(AF11,Feiertage!$A$3:$B$29,2,FALSE),\"\")","v":"Pfingsten"},{"$f":"IFERROR(VLOOKUP(AF11,Mondphasen!$G$23:$H$36,2,FALSE),\"\")","v":""},23,"2025-07-08",45846,"2025-07-08",{"$f":"IFERROR(VLOOKUP(AL11,Feiertage!$A$3:$B$29,2,FALSE),\"\")","v":""},{"$f":"IFERROR(VLOOKUP(AL11,Mondphasen!$G$23:$H$36,2,FALSE),\"\")","v":""},28,"2025-08-08",45877,"2025-08-08",{"$f":"IFERROR(VLOOKUP(AR11,Feiertage!$A$3:$B$29,2,FALSE),\"\")","v":""},{"$f":"IFERROR(VLOOKUP(AR11,Mondphasen!$G$23:$H$36,2,FALSE),\"\")","v":""},32,"2025-09-08",45908,"2025-09-08",{"$f":"IFERROR(VLOOKUP(AX11,Feiertage!$A$3:$B$29,2,FALSE),\"\")","v":""},{"$f":"IFERROR(VLOOKUP(AX11,Mondphasen!$G$23:$H$36,2,FALSE),\"\")","v":""},37,"2025-10-08",45938,"2025-10-08",{"$f":"IFERROR(VLOOKUP(BD11,Feiertage!$A$3:$B$29,2,FALSE),\"\")","v":""},{"$f":"IFERROR(VLOOKUP(BD11,Mondphasen!$G$23:$H$36,2,FALSE),\"\")","v":""},41,"2025-11-08",45969,"2025-11-08",{"$f":"IFERROR(VLOOKUP(BJ11,Feiertage!$A$3:$B$29,2,FALSE),\"\")","v":""},{"$f":"IFERROR(VLOOKUP(BJ11,Mondphasen!$G$23:$H$36,2,FALSE),\"\")","v":""},45,"2025-12-08",45999,"2025-12-08",{"$f":"IFERROR(VLOOKUP(BP11,Feiertage!$A$3:$B$29,2,FALSE),\"\")","v":""},{"$f":"IFERROR(VLOOKUP(BP11,Mondphasen!$G$23:$H$36,2,FALSE),\"\")","v":""},50]
["2025-01-09",45666,"2025-01-09",{"$f":"IFERROR(VLOOKUP(B12,Feiertage!$A$3:$B$29,2,FALSE),\"\")","v":""},{"$f":"IFERROR(VLOOKUP(B12,Mondphasen!$G$23:$H$36,2,FALSE),\"\")","v":""},2,"2025-02-09",45697,"2025-02-09",{"$f":"IFERROR(VLOOKUP(H12,Feiertage!$A$3:$B$29,2,FALSE),\"\")","v":""},{"$f":"IFERROR(VLOOKUP(H12,Mondphasen!$G$23:$H$36,2,FALSE),\"\")","v":""},6,"2025-03-09",45725,"2025-03-09",{"$f":"IFERROR(VLOOKUP(N12,Feiertage!$A$3:$B$29,2,FALSE),\"\")","v":""},{"$f":"IFERROR(VLOOKUP(N12,Mondphasen!$G$23:$H$36,2,FALSE),\"\")","v":""},10,"2025-04-09",45756,"2025-04-09",{"$f":"IFERROR(VLOOKUP(T12,Feiertage!$A$3:$B$29,2,FALSE),\"\")","v":""},{"$f":"IFERROR(VLOOKUP(T12,Mondphasen!$G$23:$H$36,2,FALSE),\"\")","v":""},15,"2025-05-09",45786,"2025-05-09",{"$f":"IFERROR(VLOOKUP(Z12,Feiertage!$A$3:$B$29,2,FALSE),\"\")","v":""},{"$f":"IFERROR(VLOOKUP(Z12,Mondphasen!$G$23:$H$36,2,FALSE),\"\")","v":""},19,"2025-06-09",45817,"2025-06-09",{"$f":"IFERROR(VLOOKUP(AF12,Feiertage!$A$3:$B$29,2,FALSE),\"\")","v":"Pfingst-Montag"},{"$f":"IFERROR(VLOOKUP(AF12,Mondphasen!$G$23:$H$36,2,FALSE),\"\")","v":""},24,"2025-07-09",45847,"2025-07-09",{"$f":"IFERROR(VLOOKUP(AL12,Feiertage!$A$3:$B$29,2,FALSE),\"\")","v":""},{"$f":"IFERROR(VLOOKUP(AL12,Mondphasen!$G$23:$H$36,2,FALSE),\"\")","v":""},28,"2025-08-09",45878,"2025-08-09",{"$f":"IFERROR(VLOOKUP(AR12,Feiertage!$A$3:$B$29,2,FALSE),\"\")","v":""},{"$f":"IFERROR(VLOOKUP(AR12,Mondphasen!$G$23:$H$36,2,FALSE),\"\")","v":"l"},32,"2025-09-09",45909,"2025-09-09",{"$f":"IFERROR(VLOOKUP(AX12,Feiertage!$A$3:$B$29,2,FALSE),\"\")","v":""},{"$f":"IFERROR(VLOOKUP(AX12,Mondphasen!$G$23:$H$36,2,FALSE),\"\")","v":""},37,"2025-10-09",45939,"2025-10-09",{"$f":"IFERROR(VLOOKUP(BD12,Feiertage!$A$3:$B$29,2,FALSE),\"\")","v":""},{"$f":"IFERROR(VLOOKUP(BD12,Mondphasen!$G$23:$H$36,2,FALSE),\"\")","v":""},41,"2025-11-09",45970,"2025-11-09",{"$f":"IFERROR(VLOOKUP(BJ12,Feiertage!$A$3:$B$29,2,FALSE),\"\")","v":""},{"$f":"IFERROR(VLOOKUP(BJ12,Mondphasen!$G$23:$H$36,2,FALSE),\"\")","v":""},45,"2025-12-09",46000,"2025-12-09",{"$f":"IFERROR(VLOOKUP(BP12,Feiertage!$A$3:$B$29,2,FALSE),\"\")","v":""},{"$f":"IFERROR(VLOOKUP(BP12,Mondphasen!$G$23:$H$36,2,FALSE),\"\")","v":""},50]
["2025-01-10",45667,"2025-01-10",{"$f":"IFERROR(VLOOKUP(B13,Feiertage!$A$3:$B$29,2,FALSE),\"\")","v":""},{"$f":"IFERROR(VLOOKUP(B13,Mondphasen!$G$23:$H$36,2,FALSE),\"\")","v":""},2,"2025-02-10",45698,"2025-02-10",{"$f":"IFERROR(VLOOKUP(H13,Feiertage!$A$3:$B$29,2,FALSE),\"\")","v":""},{"$f":"IFERROR(VLOOKUP(H13,Mondphasen!$G$23:$H$36,2,FALSE),\"\")","v":""},7,"2025-03-10",45726,"2025-03-10",{"$f":"IFERROR(VLOOKUP(N13,Feiertage!$A$3:$B$29,2,FALSE),\"\")","v":""},{"$f":"IFERROR(VLOOKUP(N13,Mondphasen!$G$23:$H$36,2,FALSE),\"\")","v":""},11,"2025-04-10",45757,"2025-04-10",{"$f":"IFERROR(VLOOKUP(T13,Feiertage!$A$3:$B$29,2,FALSE),\"\")","v":""},{"$f":"IFERROR(VLOOKUP(T13,Mondphasen!$G$23:$H$36,2,FALSE),\"\")","v":""},15,"2025-05-10",45787,"2025-05-10",{"$f":"IFERROR(VLOOKUP(Z13,Feiertage!$A$3:$B$29,2,FALSE),\"\")","v":""},{"$f":"IFERROR(VLOOKUP(Z13,Mondphasen!$G$23:$H$36,2,FALSE),\"\")","v":""},19,"2025-06-10",45818,"2025-06-10",{"$f":"IFERROR(VLOOKUP(AF13,Feiertage!$A$3:$B$29,2,FALSE),\"\")","v":""},{"$f":"IFERROR(VLOOKUP(AF13,Mondphasen!$G$23:$H$36,2,FALSE),\"\")","v":""},24,"2025-07-10",45848,"2025-07-10",{"$f":"IFERROR(VLOOKUP(AL13,Feiertage!$A$3:$B$29,2,FALSE),\"\")","v":""},{"$f":"IFERROR(VLOOKUP(AL13,Mondphasen!$G$23:$H$36,2,FALSE),\"\")","v":"l"},28,"2025-08-10",45879,"2025-08-10",{"$f":"IFERROR(VLOOKUP(AR13,Feiertage!$A$3:$B$29,2,FALSE),\"\")","v":""},{"$f":"IFERROR(VLOOKUP(AR13,Mondphasen!$G$23:$H$36,2,FALSE),\"\")","v":""},32,"2025-09-10",45910,"2025-09-10",{"$f":"IFERROR(VLOOKUP(AX13,Feiertage!$A$3:$B$29,2,FALSE),\"\")","v":""},{"$f":"IFERROR(VLOOKUP(AX13,Mondphasen!$G$23:$H$36,2,FALSE),\"\")","v":""},37,"2025-10-10",45940,"2025-10-10",{"$f":"IFERROR(VLOOKUP(BD13,Feiertage!$A$3:$B$29,2,FALSE),\"\")","v":""},{"$f":"IFERROR(VLOOKUP(BD13,Mondphasen!$G$23:$H$36,2,FALSE),\"\")","v":""},41,"2025-11-10",45971,"2025-11-10",{"$f":"IFERROR(VLOOKUP(BJ13,Feiertage!$A$3:$B$29,2,FALSE),\"\")","v":""},{"$f":"IFERROR(VLOOKUP(BJ13,Mondphasen!$G$23:$H$36,2,FALSE),\"\")","v":""},46,"2025-12-10",46001,"2025-12-10",{"$f":"IFERROR(VLOOKUP(BP13,Feiertage!$A$3:$B$29,2,FALSE),\"\")","v":""},{"$f":"IFERROR(VLOOKUP(BP13,Mondphasen!$G$23:$H$36,2,FALSE),\"\")","v":""},50]
["2025-01-11",45668,"2025-01-11",{"$f":"IFERROR(VLOOKUP(B14,Feiertage!$A$3:$B$29,2,FALSE),\"\")","v":""},{"$f":"IFERROR(VLOOKUP(B14,Mondphasen!$G$23:$H$36,2,FALSE),\"\")","v":""},2,"2025-02-11",45699,"2025-02-11",{"$f":"IFERROR(VLOOKUP(H14,Feiertage!$A$3:$B$29,2,FALSE),\"\")","v":""},{"$f":"IFERROR(VLOOKUP(H14,Mondphasen!$G$23:$H$36,2,FALSE),\"\")","v":""},7,"2025-03-11",45727,"2025-03-11",{"$f":"IFERROR(VLOOKUP(N14,Feiertage!$A$3:$B$29,2,FALSE),\"\")","v":""},{"$f":"IFERROR(VLOOKUP(N14,Mondphasen!$G$23:$H$36,2,FALSE),\"\")","v":""},11,"2025-04-11",45758,"2025-04-11",{"$f":"IFERROR(VLOOKUP(T14,Feiertage!$A$3:$B$29,2,FALSE),\"\")","v":""},{"$f":"IFERROR(VLOOKUP(T14,Mondphasen!$G$23:$H$36,2,FALSE),\"\")","v":""},15,"2025-05-11",45788,"2025-05-11",{"$f":"IFERROR(VLOOKUP(Z14,Feiertage!$A$3:$B$29,2,FALSE),\"\")","v":"Muttertag"},{"$f":"IFERROR(VLOOKUP(Z14,Mondphasen!$G$23:$H$36,2,FALSE),\"\")","v":""},19,"2025-06-11",45819,"2025-06-11",{"$f":"IFERROR(VLOOKUP(AF14,Feiertage!$A$3:$B$29,2,FALSE),\"\")","v":""},{"$f":"IFERROR(VLOOKUP(AF14,Mondphasen!$G$23:$H$36,2,FALSE),\"\")","v":"l"},24,"2025-07-11",45849,"2025-07-11",{"$f":"IFERROR(VLOOKUP(AL14,Feiertage!$A$3:$B$29,2,FALSE),\"\")","v":""},{"$f":"IFERROR(VLOOKUP(AL14,Mondphasen!$G$23:$H$36,2,FALSE),\"\")","v":""},28,"2025-08-11",45880,"2025-08-11",{"$f":"IFERROR(VLOOKUP(AR14,Feiertage!$A$3:$B$29,2,FALSE),\"\")","v":""},{"$f":"IFERROR(VLOOKUP(AR14,Mondphasen!$G$23:$H$36,2,FALSE),\"\")","v":""},33,"2025-09-11",45911,"2025-09-11",{"$f":"IFERROR(VLOOKUP(AX14,Feiertage!$A$3:$B$29,2,FALSE),\"\")","v":""},{"$f":"IFERROR(VLOOKUP(AX14,Mondphasen!$G$23:$H$36,2,FALSE),\"\")","v":""},37,"2025-10-11",45941,"2025-10-11",{"$f":"IFERROR(VLOOKUP(BD14,Feiertage!$A$3:$B$29,2,FALSE),\"\")","v":""},{"$f":"IFERROR(VLOOKUP(BD14,Mondphasen!$G$23:$H$36,2,FALSE),\"\")","v":""},41,"2025-11-11",45972,"2025-11-11",{"$f":"IFERROR(VLOOKUP(BJ14,Feiertage!$A$3:$B$29,2,FALSE),\"\")","v":""},{"$f":"IFERROR(VLOOKUP(BJ14,Mondphasen!$G$23:$H$36,2,FALSE),\"\")","v":""},46,"2025-12-11",46002,"2025-12-11",{"$f":"IFERROR(VLOOKUP(BP14,Feiertage!$A$3:$B$29,2,FALSE),\"\")","v":""},{"$f":"IFERROR(VLOOKUP(BP14,Mondphasen!$G$23:$H$36,2,FALSE),\"\")","v":""},50]
["2025-01-12",45669,"2025-01-12",{"$f":"IFERROR(VLOOKUP(B15,Feiertage!$A$3:$B$29,2,FALSE),\"\")","v":""},{"$f":"IFERROR(VLOOKUP(B15,Mondphasen!$G$23:$H$36,2,FALSE),\"\")","v":""},2,"2025-02-12",45700,"2025-02-12",{"$f":"IFERROR(VLOOKUP(H15,Feiertage!$A$3:$B$29,2,FALSE),\"\")","v":""},{"$f":"IFERROR(VLOOKUP(H15,Mondphasen!$G$23:$H$36,2,FALSE),\"\")","v":"l"},7,"2025-03-12",45728,"2025-03-12",{"$f":"IFERROR(VLOOKUP(N15,Feiertage!$A$3:$B$29,2,FALSE),\"\")","v":""},{"$f":"IFERROR(VLOOKUP(N15,Mondphasen!$G$23:$H$36,2,FALSE),\"\")","v":""},11,"2025-04-12",45759,"2025-04-12",{"$f":"IFERROR(VLOOKUP(T15,Feiertage!$A$3:$B$29,2,FALSE),\"\")","v":""},{"$f":"IFERROR(VLOOKUP(T15,Mondphasen!$G$23:$H$36,2,FALSE),\"\")","v":""},15,"2025-05-12",45789,"2025-05-12",{"$f":"IFERROR(VLOOKUP(Z15,Feiertage!$A$3:$B$29,2,FALSE),\"\")","v":""},{"$f":"IFERROR(VLOOKUP(Z15,Mondphasen!$G$23:$H$36,2,FALSE),\"\")","v":"l"},20,"2025-06-12",45820,"2025-06-12",{"$f":"IFERROR(VLOOKUP(AF15,Feiertage!$A$3:$B$29,2,FALSE),\"\")","v":""},{"$f":"IFERROR(VLOOKUP(AF15,Mondphasen!$G$23:$H$36,2,FALSE),\"\")","v":""},24,"2025-07-12",45850,"2025-07-12",{"$f":"IFERROR(VLOOKUP(AL15,Feiertage!$A$3:$B$29,2,FALSE),\"\")","v":""},{"$f":"IFERROR(VLOOKUP(AL15,Mondphasen!$G$23:$H$36,2,FALSE),\"\")","v":""},28,"2025-08-12",45881,"2025-08-12",{"$f":"IFERROR(VLOOKUP(AR15,Feiertage!$A$3:$B$29,2,FALSE),\"\")","v":""},{"$f":"IFERROR(VLOOKUP(AR15,Mondphasen!$G$23:$H$36,2,FALSE),\"\")","v":""},33,"2025-09-12",45912,"2025-09-12",{"$f":"IFERROR(VLOOKUP(AX15,Feiertage!$A$3:$B$29,2,FALSE),\"\")","v":""},{"$f":"IFERROR(VLOOKUP(AX15,Mondphasen!$G$23:$H$36,2,FALSE),\"\")","v":""},37,"2025-10-12",45942,"2025-10-12",{"$f":"IFERROR(VLOOKUP(BD15,Feiertage!$A$3:$B$29,2,FALSE),\"\")","v":""},{"$f":"IFERROR(VLOOKUP(BD15,Mondphasen!$G$23:$H$36,2,FALSE),\"\")","v":""},41,"2025-11-12",45973,"2025-11-12",{"$f":"IFERROR(VLOOKUP(BJ15,Feiertage!$A$3:$B$29,2,FALSE),\"\")","v":""},{"$f":"IFERROR(VLOOKUP(BJ15,Mondphasen!$G$23:$H$36,2,FALSE),\"\")","v":""},46,"2025-12-12",46003,"2025-12-12",{"$f":"IFERROR(VLOOKUP(BP15,Feiertage!$A$3:$B$29,2,FALSE),\"\")","v":""},{"$f":"IFERROR(VLOOKUP(BP15,Mondphasen!$G$23:$H$36,2,FALSE),\"\")","v":""},50]
["2025-01-13",45670,"2025-01-13",{"$f":"IFERROR(VLOOKUP(B16,Feiertage!$A$3:$B$29,2,FALSE),\"\")","v":""},{"$f":"IFERROR(VLOOKUP(B16,Mondphasen!$G$23:$H$36,2,FALSE),\"\")","v":""},3,"2025-02-13",45701,"2025-02-13",{"$f":"IFERROR(VLOOKUP(H16,Feiertage!$A$3:$B$29,2,FALSE),\"\")","v":""},{"$f":"IFERROR(VLOOKUP(H16,Mondphasen!$G$23:$H$36,2,FALSE),\"\")","v":""},7,"2025-03-13",45729,"2025-03-13",{"$f":"IFERROR(VLOOKUP(N16,Feiertage!$A$3:$B$29,2,FALSE),\"\")","v":""},{"$f":"IFERROR(VLOOKUP(N16,Mondphasen!$G$23:$H$36,2,FALSE),\"\")","v":""},11,"2025-04-13",45760,"2025-04-13",{"$f":"IFERROR(VLOOKUP(T16,Feiertage!$A$3:$B$29,2,FALSE),\"\")","v":"Palmsonntag"},{"$f":"IFERROR(VLOOKUP(T16,Mondphasen!$G$23:$H$36,2,FALSE),\"\")","v":"l"},15,"2025-05-13",45790,"2025-05-13",{"$f":"IFERROR(VLOOKUP(Z16,Feiertage!$A$3:$B$29,2,FALSE),\"\")","v":""},{"$f":"IFERROR(VLOOKUP(Z16,Mondphasen!$G$23:$H$36,2,FALSE),\"\")","v":""},20,"2025-06-13",45821,"2025-06-13",{"$f":"IFERROR(VLOOKUP(AF16,Feiertage!$A$3:$B$29,2,FALSE),\"\")","v":""},{"$f":"IFERROR(VLOOKUP(AF16,Mondphasen!$G$23:$H$36,2,FALSE),\"\")","v":""},24,"2025-07-13",45851,"2025-07-13",{"$f":"IFERROR(VLOOKUP(AL16,Feiertage!$A$3:$B$29,2,FALSE),\"\")","v":""},{"$f":"IFERROR(VLOOKUP(AL16,Mondphasen!$G$23:$H$36,2,FALSE),\"\")","v":""},28,"2025-08-13",45882,"2025-08-13",{"$f":"IFERROR(VLOOKUP(AR16,Feiertage!$A$3:$B$29,2,FALSE),\"\")","v":""},{"$f":"IFERROR(VLOOKUP(AR16,Mondphasen!$G$23:$H$36,2,FALSE),\"\")","v":""},33,"2025-09-13",45913,"2025-09-13",{"$f":"IFERROR(VLOOKUP(AX16,Feiertage!$A$3:$B$29,2,FALSE),\"\")","v":""},{"$f":"IFERROR(VLOOKUP(AX16,Mondphasen!$G$23:$H$36,2,FALSE),\"\")","v":""},37,"2025-10-13",45943,"2025-10-13",{"$f":"IFERROR(VLOOKUP(BD16,Feiertage!$A$3:$B$29,2,FALSE),\"\")","v":""},{"$f":"IFERROR(VLOOKUP(BD16,Mondphasen!$G$23:$H$36,2,FALSE),\"\")","v":""},42,"2025-11-13",45974,"2025-11-13",{"$f":"IFERROR(VLOOKUP(BJ16,Feiertage!$A$3:$B$29,2,FALSE),\"\")","v":""},{"$f":"IFERROR(VLOOKUP(BJ16,Mondphasen!$G$23:$H$36,2,FALSE),\"\")","v":""},46,"2025-12-13",46004,"2025-12-13",{"$f":"IFERROR(VLOOKUP(BP16,Feiertage!$A$3:$B$29,2,FALSE),\"\")","v":""},{"$f":"IFERROR(VLOOKUP(BP16,Mondphasen!$G$23:$H$36,2,FALSE),\"\")","v":""},50]
["2025-01-14",45671,"2025-01-14",{"$f":"IFERROR(VLOOKUP(B17,Feiertage!$A$3:$B$29,2,FALSE),\"\")","v":""},{"$f":"IFERROR(VLOOKUP(B17,Mondphasen!$G$23:$H$36,2,FALSE),\"\")","v":"l"},3,"2025-02-14",45702,"2025-02-14",{"$f":"IFERROR(VLOOKUP(H17,Feiertage!$A$3:$B$29,2,FALSE),\"\")","v":""},{"$f":"IFERROR(VLOOKUP(H17,Mondphasen!$G$23:$H$36,2,FALSE),\"\")","v":""},7,"2025-03-14",45730,"2025-03-14",{"$f":"IFERROR(VLOOKUP(N17,Feiertage!$A$3:$B$29,2,FALSE),\"\")","v":""},{"$f":"IFERROR(VLOOKUP(N17,Mondphasen!$G$23:$H$36,2,FALSE),\"\")","v":"l"},11,"2025-04-14",45761,"2025-04-14",{"$f":"IFERROR(VLOOKUP(T17,Feiertage!$A$3:$B$29,2,FALSE),\"\")","v":""},{"$f":"IFERROR(VLOOKUP(T17,Mondphasen!$G$23:$H$36,2,FALSE),\"\")","v":""},16,"2025-05-14",45791,"2025-05-14",{"$f":"IFERROR(VLOOKUP(Z17,Feiertage!$A$3:$B$29,2,FALSE),\"\")","v":""},{"$f":"IFERROR(VLOOKUP(Z17,Mondphasen!$G$23:$H$36,2,FALSE),\"\")","v":""},20,"2025-06-14",45822,"2025-06-14",{"$f":"IFERROR(VLOOKUP(AF17,Feiertage!$A$3:$B$29,2,FALSE),\"\")","v":""},{"$f":"IFERROR(VLOOKUP(AF17,Mondphasen!$G$23:$H$36,2,FALSE),\"\")","v":""},24,"2025-07-14",45852,"2025-07-14",{"$f":"IFERROR(VLOOKUP(AL17,Feiertage!$A$3:$B$29,2,FALSE),\"\")","v":""},{"$f":"IFERROR(VLOOKUP(AL17,Mondphasen!$G$23:$H$36,2,FALSE),\"\")","v":""},29,"2025-08-14",45883,"2025-08-14",{"$f":"IFERROR(VLOOKUP(AR17,Feiertage!$A$3:$B$29,2,FALSE),\"\")","v":""},{"$f":"IFERROR(VLOOKUP(AR17,Mondphasen!$G$23:$H$36,2,FALSE),\"\")","v":""},33,"2025-09-14",45914,"2025-09-14",{"$f":"IFERROR(VLOOKUP(AX17,Feiertage!$A$3:$B$29,2,FALSE),\"\")","v":""},{"$f":"IFERROR(VLOOKUP(AX17,Mondphasen!$G$23:$H$36,2,FALSE),\"\")","v":""},37,"2025-10-14",45944,"2025-10-14",{"$f":"IFERROR(VLOOKUP(BD17,Feiertage!$A$3:$B$29,2,FALSE),\"\")","v":""},{"$f":"IFERROR(VLOOKUP(BD17,Mondphasen!$G$23:$H$36,2,FALSE),\"\")","v":""},42,"2025-11-14",45975,"2025-11-14",{"$f":"IFERROR(VLOOKUP(BJ17,Feiertage!$A$3:$B$29,2,FALSE),\"\")","v":""},{"$f":"IFERROR(VLOOKUP(BJ17,Mondphasen!$G$23:$H$36,2,FALSE),\"\")","v":""},46,"2025-12-14",46005,"2025-12-14",{"$f":"IFERROR(VLOOKUP(BP17,Feiertage!$A$3:$B$29,2,FALSE),\"\")","v":""},{"$f":"IFERROR(VLOOKUP(BP17,Mondphasen!$G$23:$H$36,2,FALSE),\"\")","v":""},50]
["2025-01-15",45672,"2025-01-15",{"$f":"IFERROR(VLOOKUP(B18,Feiertage!$A$3:$B$29,2,FALSE),\"\")","v":""},{"$f":"IFERROR(VLOOKUP(B18,Mondphasen!$G$23:$H$36,2,FALSE),\"\")","v":""},3,"2025-02-15",45703,"2025-02-15",{"$f":"IFERROR(VLOOKUP(H18,Feiertage!$A$3:$B$29,2,FALSE),\"\")","v":""},{"$f":"IFERROR(VLOOKUP(H18,Mondphasen!$G$23:$H$36,2,FALSE),\"\")","v":""},7,"2025-03-15",45731,"2025-03-15",{"$f":"IFERROR(VLOOKUP(N18,Feiertage!$A$3:$B$29,2,FALSE),\"\")","v":""},{"$f":"IFERROR(VLOOKUP(N18,Mondphasen!$G$23:$H$36,2,FALSE),\"\")","v":""},11,"2025-04-15",45762,"2025-04-15",{"$f":"IFERROR(VLOOKUP(T18,Feiertage!$A$3:$B$29,2,FALSE),\"\")","v":""},{"$f":"IFERROR(VLOOKUP(T18,Mondphasen!$G$23:$H$36,2,FALSE),\"\")","v":""},16,"2025-05-15",45792,"2025-05-15",{"$f":"IFERROR(VLOOKUP(Z18,Feiertage!$A$3:$B$29,2,FALSE),\"\")","v":""},{"$f":"IFERROR(VLOOKUP(Z18,Mondphasen!$G$23:$H$36,2,FALSE),\"\")","v":""},20,"2025-06-15",45823,"2025-06-15",{"$f":"IFERROR(VLOOKUP(AF18,Feiertage!$A$3:$B$29,2,FALSE),\"\")","v":""},{"$f":"IFERROR(VLOOKUP(AF18,Mondphasen!$G$23:$H$36,2,FALSE),\"\")","v":""},24,"2025-07-15",45853,"2025-07-15",{"$f":"IFERROR(VLOOKUP(AL18,Feiertage!$A$3:$B$29,2,FALSE),\"\")","v":""},{"$f":"IFERROR(VLOOKUP(AL18,Mondphasen!$G$23:$H$36,2,FALSE),\"\")","v":""},29,"2025-08-15",45884,"2025-08-15",{"$f":"IFERROR(VLOOKUP(AR18,Feiertage!$A$3:$B$29,2,FALSE),\"\")","v":"Maria-Himmelfahrt"},{"$f":"IFERROR(VLOOKUP(AR18,Mondphasen!$G$23:$H$36,2,FALSE),\"\")","v":""},33,"2025-09-15",45915,"2025-09-15",{"$f":"IFERROR(VLOOKUP(AX18,Feiertage!$A$3:$B$29,2,FALSE),\"\")","v":""},{"$f":"IFERROR(VLOOKUP(AX18,Mondphasen!$G$23:$H$36,2,FALSE),\"\")","v":""},38,"2025-10-15",45945,"2025-10-15",{"$f":"IFERROR(VLOOKUP(BD18,Feiertage!$A$3:$B$29,2,FALSE),\"\")","v":""},{"$f":"IFERROR(VLOOKUP(BD18,Mondphasen!$G$23:$H$36,2,FALSE),\"\")","v":""},42,"2025-11-15",45976,"2025-11-15",{"$f":"IFERROR(VLOOKUP(BJ18,Feiertage!$A$3:$B$29,2,FALSE),\"\")","v":""},{"$f":"IFERROR(VLOOKUP(BJ18,Mondphasen!$G$23:$H$36,2,FALSE),\"\")","v":""},46,"2025-12-15",46006,"2025-12-15",{"$f":"IFERROR(VLOOKUP(BP18,Feiertage!$A$3:$B$29,2,FALSE),\"\")","v":""},{"$f":"IFERROR(VLOOKUP(BP18,Mondphasen!$G$23:$H$36,2,FALSE),\"\")","v":""},51]
["2025-01-16",45673,"2025-01-16",{"$f":"IFERROR(VLOOKUP(B19,Feiertage!$A$3:$B$29,2,FALSE),\"\")","v":""},{"$f":"IFERROR(VLOOKUP(B19,Mondphasen!$G$23:$H$36,2,FALSE),\"\")","v":""},3,"2025-02-16",45704,"2025-02-16",{"$f":"IFERROR(VLOOKUP(H19,Feiertage!$A$3:$B$29,2,FALSE),\"\")","v":""},{"$f":"IFERROR(VLOOKUP(H19,Mondphasen!$G$23:$H$36,2,FALSE),\"\")","v":""},7,"2025-03-16",45732,"2025-03-16",{"$f":"IFERROR(VLOOKUP(N19,Feiertage!$A$3:$B$29,2,FALSE),\"\")","v":""},{"$f":"IFERROR(VLOOKUP(N19,Mondphasen!$G$23:$H$36,2,FALSE),\"\")","v":""},11,"2025-04-16",45763,"2025-04-16",{"$f":"IFERROR(VLOOKUP(T19,Feiertage!$A$3:$B$29,2,FALSE),\"\")","v":""},{"$f":"IFERROR(VLOOKUP(T19,Mondphasen!$G$23:$H$36,2,FALSE),\"\")","v":""},16,"2025-05-16",45793,"2025-05-16",{"$f":"IFERROR(VLOOKUP(Z19,Feiertage!$A$3:$B$29,2,FALSE),\"\")","v":""},{"$f":"IFERROR(VLOOKUP(Z19,Mondphasen!$G$23:$H$36,2,FALSE),\"\")","v":""},20,"2025-06-16",45824,"2025-06-16",{"$f":"IFERROR(VLOOKUP(AF19,Feiertage!$A$3:$B$29,2,FALSE),\"\")","v":""},{"$f":"IFERROR(VLOOKUP(AF19,Mondphasen!$G$23:$H$36,2,FALSE),\"\")","v":""},25,"2025-07-16",45854,"2025-07-16",{"$f":"IFERROR(VLOOKUP(AL19,Feiertage!$A$3:$B$29,2,FALSE),\"\")","v":""},{"$f":"IFERROR(VLOOKUP(AL19,Mondphasen!$G$23:$H$36,2,FALSE),\"\")","v":""},29,"2025-08-16",45885,"2025-08-16",{"$f":"IFERROR(VLOOKUP(AR19,Feiertage!$A$3:$B$29,2,FALSE),\"\")","v":""},{"$f":"IFERROR(VLOOKUP(AR19,Mondphasen!$G$23:$H$36,2,FALSE),\"\")","v":""},33,"2025-09-16",45916,"2025-09-16",{"$f":"IFERROR(VLOOKUP(AX19,Feiertage!$A$3:$B$29,2,FALSE),\"\")","v":""},{"$f":"IFERROR(VLOOKUP(AX19,Mondphasen!$G$23:$H$36,2,FALSE),\"\")","v":""},38,"2025-10-16",45946,"2025-10-16",{"$f":"IFERROR(VLOOKUP(BD19,Feiertage!$A$3:$B$29,2,FALSE),\"\")","v":""},{"$f":"IFERROR(VLOOKUP(BD19,Mondphasen!$G$23:$H$36,2,FALSE),\"\")","v":""},42,"2025-11-16",45977,"2025-11-16",{"$f":"IFERROR(VLOOKUP(BJ19,Feiertage!$A$3:$B$29,2,FALSE),\"\")","v":""},{"$f":"IFERROR(VLOOKUP(BJ19,Mondphasen!$G$23:$H$36,2,FALSE),\"\")","v":""},46,"2025-12-16",46007,"2025-12-16",{"$f":"IFERROR(VLOOKUP(BP19,Feiertage!$A$3:$B$29,2,FALSE),\"\")","v":""},{"$f":"IFERROR(VLOOKUP(BP19,Mondphasen!$G$23:$H$36,2,FALSE),\"\")","v":""},51]
["2025-01-17",45674,"2025-01-17",{"$f":"IFERROR(VLOOKUP(B20,Feiertage!$A$3:$B$29,2,FALSE),\"\")","v":""},{"$f":"IFERROR(VLOOKUP(B20,Mondphasen!$G$23:$H$36,2,FALSE),\"\")","v":""},3,"2025-02-17",45705,"2025-02-17",{"$f":"IFERROR(VLOOKUP(H20,Feiertage!$A$3:$B$29,2,FALSE),\"\")","v":""},{"$f":"IFERROR(VLOOKUP(H20,Mondphasen!$G$23:$H$36,2,FALSE),\"\")","v":""},8,"2025-03-17",45733,"2025-03-17",{"$f":"IFERROR(VLOOKUP(N20,Feiertage!$A$3:$B$29,2,FALSE),\"\")","v":""},{"$f":"IFERROR(VLOOKUP(N20,Mondphasen!$G$23:$H$36,2,FALSE),\"\")","v":""},12,"2025-04-17",45764,"2025-04-17",{"$f":"IFERROR(VLOOKUP(T20,Feiertage!$A$3:$B$29,2,FALSE),\"\")","v":"Grün-Donnerstag"},{"$f":"IFERROR(VLOOKUP(T20,Mondphasen!$G$23:$H$36,2,FALSE),\"\")","v":""},16,"2025-05-17",45794,"2025-05-17",{"$f":"IFERROR(VLOOKUP(Z20,Feiertage!$A$3:$B$29,2,FALSE),\"\")","v":""},{"$f":"IFERROR(VLOOKUP(Z20,Mondphasen!$G$23:$H$36,2,FALSE),\"\")","v":""},20,"2025-06-17",45825,"2025-06-17",{"$f":"IFERROR(VLOOKUP(AF20,Feiertage!$A$3:$B$29,2,FALSE),\"\")","v":""},{"$f":"IFERROR(VLOOKUP(AF20,Mondphasen!$G$23:$H$36,2,FALSE),\"\")","v":""},25,"2025-07-17",45855,"2025-07-17",{"$f":"IFERROR(VLOOKUP(AL20,Feiertage!$A$3:$B$29,2,FALSE),\"\")","v":""},{"$f":"IFERROR(VLOOKUP(AL20,Mondphasen!$G$23:$H$36,2,FALSE),\"\")","v":""},29,"2025-08-17",45886,"2025-08-17",{"$f":"IFERROR(VLOOKUP(AR20,Feiertage!$A$3:$B$29,2,FALSE),\"\")","v":""},{"$f":"IFERROR(VLOOKUP(AR20,Mondphasen!$G$23:$H$36,2,FALSE),\"\")","v":""},33,"2025-09-17",45917,"2025-09-17",{"$f":"IFERROR(VLOOKUP(AX20,Feiertage!$A$3:$B$29,2,FALSE),\"\")","v":""},{"$f":"IFERROR(VLOOKUP(AX20,Mondphasen!$G$23:$H$36,2,FALSE),\"\")","v":""},38,"2025-10-17",45947,"2025-10-17",{"$f":"IFERROR(VLOOKUP(BD20,Feiertage!$A$3:$B$29,2,FALSE),\"\")","v":""},{"$f":"IFERROR(VLOOKUP(BD20,Mondphasen!$G$23:$H$36,2,FALSE),\"\")","v":""},42,"2025-11-17",45978,"2025-11-17",{"$f":"IFERROR(VLOOKUP(BJ20,Feiertage!$A$3:$B$29,2,FALSE),\"\")","v":""},{"$f":"IFERROR(VLOOKUP(BJ20,Mondphasen!$G$23:$H$36,2,FALSE),\"\")","v":""},47,"2025-12-17",46008,"2025-12-17",{"$f":"IFERROR(VLOOKUP(BP20,Feiertage!$A$3:$B$29,2,FALSE),\"\")","v":""},{"$f":"IFERROR(VLOOKUP(BP20,Mondphasen!$G$23:$H$36,2,FALSE),\"\")","v":""},51]
["2025-01-18",45675,"2025-01-18",{"$f":"IFERROR(VLOOKUP(B21,Feiertage!$A$3:$B$29,2,FALSE),\"\")","v":""},{"$f":"IFERROR(VLOOKUP(B21,Mondphasen!$G$23:$H$36,2,FALSE),\"\")","v":""},3,"2025-02-18",45706,"2025-02-18",{"$f":"IFERROR(VLOOKUP(H21,Feiertage!$A$3:$B$29,2,FALSE),\"\")","v":""},{"$f":"IFERROR(VLOOKUP(H21,Mondphasen!$G$23:$H$36,2,FALSE),\"\")","v":""},8,"2025-03-18",45734,"2025-03-18",{"$f":"IFERROR(VLOOKUP(N21,Feiertage!$A$3:$B$29,2,FALSE),\"\")","v":""},{"$f":"IFERROR(VLOOKUP(N21,Mondphasen!$G$23:$H$36,2,FALSE),\"\")","v":""},12,"2025-04-18",45765,"2025-04-18",{"$f":"IFERROR(VLOOKUP(T21,Feiertage!$A$3:$B$29,2,FALSE),\"\")","v":"Karfreitag"},{"$f":"IFERROR(VLOOKUP(T21,Mondphasen!$G$23:$H$36,2,FALSE),\"\")","v":""},16,"2025-05-18",45795,"2025-05-18",{"$f":"IFERROR(VLOOKUP(Z21,Feiertage!$A$3:$B$29,2,FALSE),\"\")","v":""},{"$f":"IFERROR(VLOOKUP(Z21,Mondphasen!$G$23:$H$36,2,FALSE),\"\")","v":""},20,"2025-06-18",45826,"2025-06-18",{"$f":"IFERROR(VLOOKUP(AF21,Feiertage!$A$3:$B$29,2,FALSE),\"\")","v":""},{"$f":"IFERROR(VLOOKUP(AF21,Mondphasen!$G$23:$H$36,2,FALSE),\"\")","v":""},25,"2025-07-18",45856,"2025-07-18",{"$f":"IFERROR(VLOOKUP(AL21,Feiertage!$A$3:$B$29,2,FALSE),\"\")","v":""},{"$f":"IFERROR(VLOOKUP(AL21,Mondphasen!$G$23:$H$36,2,FALSE),\"\")","v":""},29,"2025-08-18",45887,"2025-08-18",{"$f":"IFERROR(VLOOKUP(AR21,Feiertage!$A$3:$B$29,2,FALSE),\"\")","v":""},{"$f":"IFERROR(VLOOKUP(AR21,Mondphasen!$G$23:$H$36,2,FALSE),\"\")","v":""},34,"2025-09-18",45918,"2025-09-18",{"$f":"IFERROR(VLOOKUP(AX21,Feiertage!$A$3:$B$29,2,FALSE),\"\")","v":""},{"$f":"IFERROR(VLOOKUP(AX21,Mondphasen!$G$23:$H$36,2,FALSE),\"\")","v":""},38,"2025-10-18",45948,"2025-10-18",{"$f":"IFERROR(VLOOKUP(BD21,Feiertage!$A$3:$B$29,2,FALSE),\"\")","v":""},{"$f":"IFERROR(VLOOKUP(BD21,Mondphasen!$G$23:$H$36,2,FALSE),\"\")","v":""},42,"2025-11-18",45979,"2025-11-18",{"$f":"IFERROR(VLOOKUP(BJ21,Feiertage!$A$3:$B$29,2,FALSE),\"\")","v":""},{"$f":"IFERROR(VLOOKUP(BJ21,Mondphasen!$G$23:$H$36,2,FALSE),\"\")","v":""},47,"2025-12-18",46009,"2025-12-18",{"$f":"IFERROR(VLOOKUP(BP21,Feiertage!$A$3:$B$29,2,FALSE),\"\")","v":""},{"$f":"IFERROR(VLOOKUP(BP21,Mondphasen!$G$23:$H$36,2,FALSE),\"\")","v":""},51]
["2025-01-19",45676,"2025-01-19",{"$f":"IFERROR(VLOOKUP(B22,Feiertage!$A$3:$B$29,2,FALSE),\"\")","v":""},{"$f":"IFERROR(VLOOKUP(B22,Mondphasen!$G$23:$H$36,2,FALSE),\"\")","v":""},3,"2025-02-19",45707,"2025-02-19",{"$f":"IFERROR(VLOOKUP(H22,Feiertage!$A$3:$B$29,2,FALSE),\"\")","v":""},{"$f":"IFERROR(VLOOKUP(H22,Mondphasen!$G$23:$H$36,2,FALSE),\"\")","v":""},8,"2025-03-19",45735,"2025-03-19",{"$f":"IFERROR(VLOOKUP(N22,Feiertage!$A$3:$B$29,2,FALSE),\"\")","v":""},{"$f":"IFERROR(VLOOKUP(N22,Mondphasen!$G$23:$H$36,2,FALSE),\"\")","v":""},12,"2025-04-19",45766,"2025-04-19",{"$f":"IFERROR(VLOOKUP(T22,Feiertage!$A$3:$B$29,2,FALSE),\"\")","v":""},{"$f":"IFERROR(VLOOKUP(T22,Mondphasen!$G$23:$H$36,2,FALSE),\"\")","v":""},16,"2025-05-19",45796,"2025-05-19",{"$f":"IFERROR(VLOOKUP(Z22,Feiertage!$A$3:$B$29,2,FALSE),\"\")","v":""},{"$f":"IFERROR(VLOOKUP(Z22,Mondphasen!$G$23:$H$36,2,FALSE),\"\")","v":""},21,"2025-06-19",45827,"2025-06-19",{"$f":"IFERROR(VLOOKUP(AF22,Feiertage!$A$3:$B$29,2,FALSE),\"\")","v":"Fronleichnam"},{"$f":"IFERROR(VLOOKUP(AF22,Mondphasen!$G$23:$H$36,2,FALSE),\"\")","v":""},25,"2025-07-19",45857,"2025-07-19",{"$f":"IFERROR(VLOOKUP(AL22,Feiertage!$A$3:$B$29,2,FALSE),\"\")","v":""},{"$f":"IFERROR(VLOOKUP(AL22,Mondphasen!$G$23:$H$36,2,FALSE),\"\")","v":""},29,"2025-08-19",45888,"2025-08-19",{"$f":"IFERROR(VLOOKUP(AR22,Feiertage!$A$3:$B$29,2,FALSE),\"\")","v":""},{"$f":"IFERROR(VLOOKUP(AR22,Mondphasen!$G$23:$H$36,2,FALSE),\"\")","v":""},34,"2025-09-19",45919,"2025-09-19",{"$f":"IFERROR(VLOOKUP(AX22,Feiertage!$A$3:$B$29,2,FALSE),\"\")","v":""},{"$f":"IFERROR(VLOOKUP(AX22,Mondphasen!$G$23:$H$36,2,FALSE),\"\")","v":""},38,"2025-10-19",45949,"2025-10-19",{"$f":"IFERROR(VLOOKUP(BD22,Feiertage!$A$3:$B$29,2,FALSE),\"\")","v":""},{"$f":"IFERROR(VLOOKUP(BD22,Mondphasen!$G$23:$H$36,2,FALSE),\"\")","v":""},42,"2025-11-19",45980,"2025-11-19",{"$f":"IFERROR(VLOOKUP(BJ22,Feiertage!$A$3:$B$29,2,FALSE),\"\")","v":""},{"$f":"IFERROR(VLOOKUP(BJ22,Mondphasen!$G$23:$H$36,2,FALSE),\"\")","v":""},47,"2025-12-19",46010,"2025-12-19",{"$f":"IFERROR(VLOOKUP(BP22,Feiertage!$A$3:$B$29,2,FALSE),\"\")","v":""},{"$f":"IFERROR(VLOOKUP(BP22,Mondphasen!$G$23:$H$36,2,FALSE),\"\")","v":""},51]
["2025-01-20",45677,"2025-01-20",{"$f":"IFERROR(VLOOKUP(B23,Feiertage!$A$3:$B$29,2,FALSE),\"\")","v":""},{"$f":"IFERROR(VLOOKUP(B23,Mondphasen!$G$23:$H$36,2,FALSE),\"\")","v":""},4,"2025-02-20",45708,"2025-02-20",{"$f":"IFERROR(VLOOKUP(H23,Feiertage!$A$3:$B$29,2,FALSE),\"\")","v":""},{"$f":"IFERROR(VLOOKUP(H23,Mondphasen!$G$23:$H$36,2,FALSE),\"\")","v":""},8,"2025-03-20",45736,"2025-03-20",{"$f":"IFERROR(VLOOKUP(N23,Feiertage!$A$3:$B$29,2,FALSE),\"\")","v":""},{"$f":"IFERROR(VLOOKUP(N23,Mondphasen!$G$23:$H$36,2,FALSE),\"\")","v":""},12,"2025-04-20",45767,"2025-04-20",{"$f":"IFERROR(VLOOKUP(T23,Feiertage!$A$3:$B$29,2,FALSE),\"\")","v":"Ostersonntag"},{"$f":"IFERROR(VLOOKUP(T23,Mondphasen!$G$23:$H$36,2,FALSE),\"\")","v":""},16,"2025-05-20",45797,"2025-05-20",{"$f":"IFERROR(VLOOKUP(Z23,Feiertage!$A$3:$B$29,2,FALSE),\"\")","v":""},{"$f":"IFERROR(VLOOKUP(Z23,Mondphasen!$G$23:$H$36,2,FALSE),\"\")","v":""},21,"2025-06-20",45828,"2025-06-20",{"$f":"IFERROR(VLOOKUP(AF23,Feiertage!$A$3:$B$29,2,FALSE),\"\")","v":""},{"$f":"IFERROR(VLOOKUP(AF23,Mondphasen!$G$23:$H$36,2,FALSE),\"\")","v":""},25,"2025-07-20",45858,"2025-07-20",{"$f":"IFERROR(VLOOKUP(AL23,Feiertage!$A$3:$B$29,2,FALSE),\"\")","v":""},{"$f":"IFERROR(VLOOKUP(AL23,Mondphasen!$G$23:$H$36,2,FALSE),\"\")","v":""},29,"2025-08-20",45889,"2025-08-20",{"$f":"IFERROR(VLOOKUP(AR23,Feiertage!$A$3:$B$29,2,FALSE),\"\")","v":""},{"$f":"IFERROR(VLOOKUP(AR23,Mondphasen!$G$23:$H$36,2,FALSE),\"\")","v":""},34,"2025-09-20",45920,"2025-09-20",{"$f":"IFERROR(VLOOKUP(AX23,Feiertage!$A$3:$B$29,2,FALSE),\"\")","v":""},{"$f":"IFERROR(VLOOKUP(AX23,Mondphasen!$G$23:$H$36,2,FALSE),\"\")","v":""},38,"2025-10-20",45950,"2025-10-20",{"$f":"IFERROR(VLOOKUP(BD23,Feiertage!$A$3:$B$29,2,FALSE),\"\")","v":""},{"$f":"IFERROR(VLOOKUP(BD23,Mondphasen!$G$23:$H$36,2,FALSE),\"\")","v":""},43,"2025-11-20",45981,"2025-11-20",{"$f":"IFERROR(VLOOKUP(BJ23,Feiertage!$A$3:$B$29,2,FALSE),\"\")","v":""},{"$f":"IFERROR(VLOOKUP(BJ23,Mondphasen!$G$23:$H$36,2,FALSE),\"\")","v":""},47,"2025-12-20",46011,"2025-12-20",{"$f":"IFERROR(VLOOKUP(BP23,Feiertage!$A$3:$B$29,2,FALSE),\"\")","v":""},{"$f":"IFERROR(VLOOKUP(BP23,Mondphasen!$G$23:$H$36,2,FALSE),\"\")","v":""},51]
["2025-01-21",45678,"2025-01-21",{"$f":"IFERROR(VLOOKUP(B24,Feiertage!$A$3:$B$29,2,FALSE),\"\")","v":""},{"$f":"IFERROR(VLOOKUP(B24,Mondphasen!$G$23:$H$36,2,FALSE),\"\")","v":""},4,"2025-02-21",45709,"2025-02-21",{"$f":"IFERROR(VLOOKUP(H24,Feiertage!$A$3:$B$29,2,FALSE),\"\")","v":""},{"$f":"IFERROR(VLOOKUP(H24,Mondphasen!$G$23:$H$36,2,FALSE),\"\")","v":""},8,"2025-03-21",45737,"2025-03-21",{"$f":"IFERROR(VLOOKUP(N24,Feiertage!$A$3:$B$29,2,FALSE),\"\")","v":""},{"$f":"IFERROR(VLOOKUP(N24,Mondphasen!$G$23:$H$36,2,FALSE),\"\")","v":""},12,"2025-04-21",45768,"2025-04-21",{"$f":"IFERROR(VLOOKUP(T24,Feiertage!$A$3:$B$29,2,FALSE),\"\")","v":"Ostermontag"},{"$f":"IFERROR(VLOOKUP(T24,Mondphasen!$G$23:$H$36,2,FALSE),\"\")","v":""},17,"2025-05-21",45798,"2025-05-21",{"$f":"IFERROR(VLOOKUP(Z24,Feiertage!$A$3:$B$29,2,FALSE),\"\")","v":""},{"$f":"IFERROR(VLOOKUP(Z24,Mondphasen!$G$23:$H$36,2,FALSE),\"\")","v":""},21,"2025-06-21",45829,"2025-06-21",{"$f":"IFERROR(VLOOKUP(AF24,Feiertage!$A$3:$B$29,2,FALSE),\"\")","v":""},{"$f":"IFERROR(VLOOKUP(AF24,Mondphasen!$G$23:$H$36,2,FALSE),\"\")","v":""},25,"2025-07-21",45859,"2025-07-21",{"$f":"IFERROR(VLOOKUP(AL24,Feiertage!$A$3:$B$29,2,FALSE),\"\")","v":""},{"$f":"IFERROR(VLOOKUP(AL24,Mondphasen!$G$23:$H$36,2,FALSE),\"\")","v":""},30,"2025-08-21",45890,"2025-08-21",{"$f":"IFERROR(VLOOKUP(AR24,Feiertage!$A$3:$B$29,2,FALSE),\"\")","v":""},{"$f":"IFERROR(VLOOKUP(AR24,Mondphasen!$G$23:$H$36,2,FALSE),\"\")","v":""},34,"2025-09-21",45921,"2025-09-21",{"$f":"IFERROR(VLOOKUP(AX24,Feiertage!$A$3:$B$29,2,FALSE),\"\")","v":"Eidg. Buss und Bettag"},{"$f":"IFERROR(VLOOKUP(AX24,Mondphasen!$G$23:$H$36,2,FALSE),\"\")","v":""},38,"2025-10-21",45951,"2025-10-21",{"$f":"IFERROR(VLOOKUP(BD24,Feiertage!$A$3:$B$29,2,FALSE),\"\")","v":""},{"$f":"IFERROR(VLOOKUP(BD24,Mondphasen!$G$23:$H$36,2,FALSE),\"\")","v":""},43,"2025-11-21",45982,"2025-11-21",{"$f":"IFERROR(VLOOKUP(BJ24,Feiertage!$A$3:$B$29,2,FALSE),\"\")","v":""},{"$f":"IFERROR(VLOOKUP(BJ24,Mondphasen!$G$23:$H$36,2,FALSE),\"\")","v":""},47,"2025-12-21",46012,"2025-12-21",{"$f":"IFERROR(VLOOKUP(BP24,Feiertage!$A$3:$B$29,2,FALSE),\"\")","v":""},{"$f":"IFERROR(VLOOKUP(BP24,Mondphasen!$G$23:$H$36,2,FALSE),\"\")","v":""},51]
["2025-01-22",45679,"2025-01-22",{"$f":"IFERROR(VLOOKUP(B25,Feiertage!$A$3:$B$29,2,FALSE),\"\")","v":""},{"$f":"IFERROR(VLOOKUP(B25,Mondphasen!$G$23:$H$36,2,FALSE),\"\")","v":""},4,"2025-02-22",45710,"2025-02-22",{"$f":"IFERROR(VLOOKUP(H25,Feiertage!$A$3:$B$29,2,FALSE),\"\")","v":""},{"$f":"IFERROR(VLOOKUP(H25,Mondphasen!$G$23:$H$36,2,FALSE),\"\")","v":""},8,"2025-03-22",45738,"2025-03-22",{"$f":"IFERROR(VLOOKUP(N25,Feiertage!$A$3:$B$29,2,FALSE),\"\")","v":""},{"$f":"IFERROR(VLOOKUP(N25,Mondphasen!$G$23:$H$36,2,FALSE),\"\")","v":""},12,"2025-04-22",45769,"2025-04-22",{"$f":"IFERROR(VLOOKUP(T25,Feiertage!$A$3:$B$29,2,FALSE),\"\")","v":""},{"$f":"IFERROR(VLOOKUP(T25,Mondphasen!$G$23:$H$36,2,FALSE),\"\")","v":""},17,"2025-05-22",45799,"2025-05-22",{"$f":"IFERROR(VLOOKUP(Z25,Feiertage!$A$3:$B$29,2,FALSE),\"\")","v":""},{"$f":"IFERROR(VLOOKUP(Z25,Mondphasen!$G$23:$H$36,2,FALSE),\"\")","v":""},21,"2025-06-22",45830,"2025-06-22",{"$f":"IFERROR(VLOOKUP(AF25,Feiertage!$A$3:$B$29,2,FALSE),\"\")","v":""},{"$f":"IFERROR(VLOOKUP(AF25,Mondphasen!$G$23:$H$36,2,FALSE),\"\")","v":""},25,"2025-07-22",45860,"2025-07-22",{"$f":"IFERROR(VLOOKUP(AL25,Feiertage!$A$3:$B$29,2,FALSE),\"\")","v":""},{"$f":"IFERROR(VLOOKUP(AL25,Mondphasen!$G$23:$H$36,2,FALSE),\"\")","v":""},30,"2025-08-22",45891,"2025-08-22",{"$f":"IFERROR(VLOOKUP(AR25,Feiertage!$A$3:$B$29,2,FALSE),\"\")","v":""},{"$f":"IFERROR(VLOOKUP(AR25,Mondphasen!$G$23:$H$36,2,FALSE),\"\")","v":""},34,"2025-09-22",45922,"2025-09-22",{"$f":"IFERROR(VLOOKUP(AX25,Feiertage!$A$3:$B$29,2,FALSE),\"\")","v":""},{"$f":"IFERROR(VLOOKUP(AX25,Mondphasen!$G$23:$H$36,2,FALSE),\"\")","v":""},39,"2025-10-22",45952,"2025-10-22",{"$f":"IFERROR(VLOOKUP(BD25,Feiertage!$A$3:$B$29,2,FALSE),\"\")","v":""},{"$f":"IFERROR(VLOOKUP(BD25,Mondphasen!$G$23:$H$36,2,FALSE),\"\")","v":""},43,"2025-11-22",45983,"2025-11-22",{"$f":"IFERROR(VLOOKUP(BJ25,Feiertage!$A$3:$B$29,2,FALSE),\"\")","v":""},{"$f":"IFERROR(VLOOKUP(BJ25,Mondphasen!$G$23:$H$36,2,FALSE),\"\")","v":""},47,"2025-12-22",46013,"2025-12-22",{"$f":"IFERROR(VLOOKUP(BP25,Feiertage!$A$3:$B$29,2,FALSE),\"\")","v":""},{"$f":"IFERROR(VLOOKUP(BP25,Mondphasen!$G$23:$H$36,2,FALSE),\"\")","v":""},52]
["2025-01-23",45680,"2025-01-23",{"$f":"IFERROR(VLOOKUP(B26,Feiertage!$A$3:$B$29,2,FALSE),\"\")","v":""},{"$f":"IFERROR(VLOOKUP(B26,Mondphasen!$G$23:$H$36,2,FALSE),\"\")","v":""},4,"2025-02-23",45711,"2025-02-23",{"$f":"IFERROR(VLOOKUP(H26,Feiertage!$A$3:$B$29,2,FALSE),\"\")","v":""},{"$f":"IFERROR(VLOOKUP(H26,Mondphasen!$G$23:$H$36,2,FALSE),\"\")","v":""},8,"2025-03-23",45739,"2025-03-23",{"$f":"IFERROR(VLOOKUP(N26,Feiertage!$A$3:$B$29,2,FALSE),\"\")","v":""},{"$f":"IFERROR(VLOOKUP(N26,Mondphasen!$G$23:$H$36,2,FALSE),\"\")","v":""},12,"2025-04-23",45770,"2025-04-23",{"$f":"IFERROR(VLOOKUP(T26,Feiertage!$A$3:$B$29,2,FALSE),\"\")","v":""},{"$f":"IFERROR(VLOOKUP(T26,Mondphasen!$G$23:$H$36,2,FALSE),\"\")","v":""},17,"2025-05-23",45800,"2025-05-23",{"$f":"IFERROR(VLOOKUP(Z26,Feiertage!$A$3:$B$29,2,FALSE),\"\")","v":""},{"$f":"IFERROR(VLOOKUP(Z26,Mondphasen!$G$23:$H$36,2,FALSE),\"\")","v":""},21,"2025-06-23",45831,"2025-06-23",{"$f":"IFERROR(VLOOKUP(AF26,Feiertage!$A$3:$B$29,2,FALSE),\"\")","v":""},{"$f":"IFERROR(VLOOKUP(AF26,Mondphasen!$G$23:$H$36,2,FALSE),\"\")","v":""},26,"2025-07-23",45861,"2025-07-23",{"$f":"IFERROR(VLOOKUP(AL26,Feiertage!$A$3:$B$29,2,FALSE),\"\")","v":""},{"$f":"IFERROR(VLOOKUP(AL26,Mondphasen!$G$23:$H$36,2,FALSE),\"\")","v":""},30,"2025-08-23",45892,"2025-08-23",{"$f":"IFERROR(VLOOKUP(AR26,Feiertage!$A$3:$B$29,2,FALSE),\"\")","v":""},{"$f":"IFERROR(VLOOKUP(AR26,Mondphasen!$G$23:$H$36,2,FALSE),\"\")","v":""},34,"2025-09-23",45923,"2025-09-23",{"$f":"IFERROR(VLOOKUP(AX26,Feiertage!$A$3:$B$29,2,FALSE),\"\")","v":""},{"$f":"IFERROR(VLOOKUP(AX26,Mondphasen!$G$23:$H$36,2,FALSE),\"\")","v":""},39,"2025-10-23",45953,"2025-10-23",{"$f":"IFERROR(VLOOKUP(BD26,Feiertage!$A$3:$B$29,2,FALSE),\"\")","v":""},{"$f":"IFERROR(VLOOKUP(BD26,Mondphasen!$G$23:$H$36,2,FALSE),\"\")","v":""},43,"2025-11-23",45984,"2025-11-23",{"$f":"IFERROR(VLOOKUP(BJ26,Feiertage!$A$3:$B$29,2,FALSE),\"\")","v":""},{"$f":"IFERROR(VLOOKUP(BJ26,Mondphasen!$G$23:$H$36,2,FALSE),\"\")","v":""},47,"2025-12-23",46014,"2025-12-23",{"$f":"IFERROR(VLOOKUP(BP26,Feiertage!$A$3:$B$29,2,FALSE),\"\")","v":""},{"$f":"IFERROR(VLOOKUP(BP26,Mondphasen!$G$23:$H$36,2,FALSE),\"\")","v":""},52]
["2025-01-24",45681,"2025-01-24",{"$f":"IFERROR(VLOOKUP(B27,Feiertage!$A$3:$B$29,2,FALSE),\"\")","v":""},{"$f":"IFERROR(VLOOKUP(B27,Mondphasen!$G$23:$H$36,2,FALSE),\"\")","v":""},4,"2025-02-24",45712,"2025-02-24",{"$f":"IFERROR(VLOOKUP(H27,Feiertage!$A$3:$B$29,2,FALSE),\"\")","v":""},{"$f":"IFERROR(VLOOKUP(H27,Mondphasen!$G$23:$H$36,2,FALSE),\"\")","v":""},9,"2025-03-24",45740,"2025-03-24",{"$f":"IFERROR(VLOOKUP(N27,Feiertage!$A$3:$B$29,2,FALSE),\"\")","v":""},{"$f":"IFERROR(VLOOKUP(N27,Mondphasen!$G$23:$H$36,2,FALSE),\"\")","v":""},13,"2025-04-24",45771,"2025-04-24",{"$f":"IFERROR(VLOOKUP(T27,Feiertage!$A$3:$B$29,2,FALSE),\"\")","v":""},{"$f":"IFERROR(VLOOKUP(T27,Mondphasen!$G$23:$H$36,2,FALSE),\"\")","v":""},17,"2025-05-24",45801,"2025-05-24",{"$f":"IFERROR(VLOOKUP(Z27,Feiertage!$A$3:$B$29,2,FALSE),\"\")","v":""},{"$f":"IFERROR(VLOOKUP(Z27,Mondphasen!$G$23:$H$36,2,FALSE),\"\")","v":""},21,"2025-06-24",45832,"2025-06-24",{"$f":"IFERROR(VLOOKUP(AF27,Feiertage!$A$3:$B$29,2,FALSE),\"\")","v":""},{"$f":"IFERROR(VLOOKUP(AF27,Mondphasen!$G$23:$H$36,2,FALSE),\"\")","v":""},26,"2025-07-24",45862,"2025-07-24",{"$f":"IFERROR(VLOOKUP(AL27,Feiertage!$A$3:$B$29,2,FALSE),\"\")","v":""},{"$f":"IFERROR(VLOOKUP(AL27,Mondphasen!$G$23:$H$36,2,FALSE),\"\")","v":""},30,"2025-08-24",45893,"2025-08-24",{"$f":"IFERROR(VLOOKUP(AR27,Feiertage!$A$3:$B$29,2,FALSE),\"\")","v":""},{"$f":"IFERROR(VLOOKUP(AR27,Mondphasen!$G$23:$H$36,2,FALSE),\"\")","v":""},34,"2025-09-24",45924,"2025-09-24",{"$f":"IFERROR(VLOOKUP(AX27,Feiertage!$A$3:$B$29,2,FALSE),\"\")","v":""},{"$f":"IFERROR(VLOOKUP(AX27,Mondphasen!$G$23:$H$36,2,FALSE),\"\")","v":""},39,"2025-10-24",45954,"2025-10-24",{"$f":"IFERROR(VLOOKUP(BD27,Feiertage!$A$3:$B$29,2,FALSE),\"\")","v":""},{"$f":"IFERROR(VLOOKUP(BD27,Mondphasen!$G$23:$H$36,2,FALSE),\"\")","v":""},43,"2025-11-24",45985,"2025-11-24",{"$f":"IFERROR(VLOOKUP(BJ27,Feiertage!$A$3:$B$29,2,FALSE),\"\")","v":""},{"$f":"IFERROR(VLOOKUP(BJ27,Mondphasen!$G$23:$H$36,2,FALSE),\"\")","v":""},48,"2025-12-24",46015,"2025-12-24",{"$f":"IFERROR(VLOOKUP(BP27,Feiertage!$A$3:$B$29,2,FALSE),\"\")","v":"Heilig Abend"},{"$f":"IFERROR(VLOOKUP(BP27,Mondphasen!$G$23:$H$36,2,FALSE),\"\")","v":""},52]
["2025-01-25",45682,"2025-01-25",{"$f":"IFERROR(VLOOKUP(B28,Feiertage!$A$3:$B$29,2,FALSE),\"\")","v":""},{"$f":"IFERROR(VLOOKUP(B28,Mondphasen!$G$23:$H$36,2,FALSE),\"\")","v":""},4,"2025-02-25",45713,"2025-02-25",{"$f":"IFERROR(VLOOKUP(H28,Feiertage!$A$3:$B$29,2,FALSE),\"\")","v":""},{"$f":"IFERROR(VLOOKUP(H28,Mondphasen!$G$23:$H$36,2,FALSE),\"\")","v":""},9,"2025-03-25",45741,"2025-03-25",{"$f":"IFERROR(VLOOKUP(N28,Feiertage!$A$3:$B$29,2,FALSE),\"\")","v":""},{"$f":"IFERROR(VLOOKUP(N28,Mondphasen!$G$23:$H$36,2,FALSE),\"\")","v":""},13,"2025-04-25",45772,"2025-04-25",{"$f":"IFERROR(VLOOKUP(T28,Feiertage!$A$3:$B$29,2,FALSE),\"\")","v":""},{"$f":"IFERROR(VLOOKUP(T28,Mondphasen!$G$23:$H$36,2,FALSE),\"\")","v":""},17,"2025-05-25",45802,"2025-05-25",{"$f":"IFERROR(VLOOKUP(Z28,Feiertage!$A$3:$B$29,2,FALSE),\"\")","v":""},{"$f":"IFERROR(VLOOKUP(Z28,Mondphasen!$G$23:$H$36,2,FALSE),\"\")","v":""},21,"2025-06-25",45833,"2025-06-25",{"$f":"IFERROR(VLOOKUP(AF28,Feiertage!$A$3:$B$29,2,FALSE),\"\")","v":""},{"$f":"IFERROR(VLOOKUP(AF28,Mondphasen!$G$23:$H$36,2,FALSE),\"\")","v":""},26,"2025-07-25",45863,"2025-07-25",{"$f":"IFERROR(VLOOKUP(AL28,Feiertage!$A$3:$B$29,2,FALSE),\"\")","v":""},{"$f":"IFERROR(VLOOKUP(AL28,Mondphasen!$G$23:$H$36,2,FALSE),\"\")","v":""},30,"2025-08-25",45894,"2025-08-25",{"$f":"IFERROR(VLOOKUP(AR28,Feiertage!$A$3:$B$29,2,FALSE),\"\")","v":""},{"$f":"IFERROR(VLOOKUP(AR28,Mondphasen!$G$23:$H$36,2,FALSE),\"\")","v":""},35,"2025-09-25",45925,"2025-09-25",{"$f":"IFERROR(VLOOKUP(AX28,Feiertage!$A$3:$B$29,2,FALSE),\"\")","v":""},{"$f":"IFERROR(VLOOKUP(AX28,Mondphasen!$G$23:$H$36,2,FALSE),\"\")","v":""},39,"2025-10-25",45955,"2025-10-25",{"$f":"IFERROR(VLOOKUP(BD28,Feiertage!$A$3:$B$29,2,FALSE),\"\")","v":""},{"$f":"IFERROR(VLOOKUP(BD28,Mondphasen!$G$23:$H$36,2,FALSE),\"\")","v":""},43,"2025-11-25",45986,"2025-11-25",{"$f":"IFERROR(VLOOKUP(BJ28,Feiertage!$A$3:$B$29,2,FALSE),\"\")","v":""},{"$f":"IFERROR(VLOOKUP(BJ28,Mondphasen!$G$23:$H$36,2,FALSE),\"\")","v":""},48,"2025-12-25",46016,"2025-12-25",{"$f":"IFERROR(VLOOKUP(BP28,Feiertage!$A$3:$B$29,2,FALSE),\"\")","v":"Weihnachten"},{"$f":"IFERROR(VLOOKUP(BP28,Mondphasen!$G$23:$H$36,2,FALSE),\"\")","v":""},52]
["2025-01-26",45683,"2025-01-26",{"$f":"IFERROR(VLOOKUP(B29,Feiertage!$A$3:$B$29,2,FALSE),\"\")","v":""},{"$f":"IFERROR(VLOOKUP(B29,Mondphasen!$G$23:$H$36,2,FALSE),\"\")","v":""},4,"2025-02-26",45714,"2025-02-26",{"$f":"IFERROR(VLOOKUP(H29,Feiertage!$A$3:$B$29,2,FALSE),\"\")","v":""},{"$f":"IFERROR(VLOOKUP(H29,Mondphasen!$G$23:$H$36,2,FALSE),\"\")","v":""},9,"2025-03-26",45742,"2025-03-26",{"$f":"IFERROR(VLOOKUP(N29,Feiertage!$A$3:$B$29,2,FALSE),\"\")","v":""},{"$f":"IFERROR(VLOOKUP(N29,Mondphasen!$G$23:$H$36,2,FALSE),\"\")","v":""},13,"2025-04-26",45773,"2025-04-26",{"$f":"IFERROR(VLOOKUP(T29,Feiertage!$A$3:$B$29,2,FALSE),\"\")","v":""},{"$f":"IFERROR(VLOOKUP(T29,Mondphasen!$G$23:$H$36,2,FALSE),\"\")","v":""},17,"2025-05-26",45803,"2025-05-26",{"$f":"IFERROR(VLOOKUP(Z29,Feiertage!$A$3:$B$29,2,FALSE),\"\")","v":""},{"$f":"IFERROR(VLOOKUP(Z29,Mondphasen!$G$23:$H$36,2,FALSE),\"\")","v":""},22,"2025-06-26",45834,"2025-06-26",{"$f":"IFERROR(VLOOKUP(AF29,Feiertage!$A$3:$B$29,2,FALSE),\"\")","v":""},{"$f":"IFERROR(VLOOKUP(AF29,Mondphasen!$G$23:$H$36,2,FALSE),\"\")","v":""},26,"2025-07-26",45864,"2025-07-26",{"$f":"IFERROR(VLOOKUP(AL29,Feiertage!$A$3:$B$29,2,FALSE),\"\")","v":""},{"$f":"IFERROR(VLOOKUP(AL29,Mondphasen!$G$23:$H$36,2,FALSE),\"\")","v":""},30,"2025-08-26",45895,"2025-08-26",{"$f":"IFERROR(VLOOKUP(AR29,Feiertage!$A$3:$B$29,2,FALSE),\"\")","v":""},{"$f":"IFERROR(VLOOKUP(AR29,Mondphasen!$G$23:$H$36,2,FALSE),\"\")","v":""},35,"2025-09-26",45926,"2025-09-26",{"$f":"IFERROR(VLOOKUP(AX29,Feiertage!$A$3:$B$29,2,FALSE),\"\")","v":""},{"$f":"IFERROR(VLOOKUP(AX29,Mondphasen!$G$23:$H$36,2,FALSE),\"\")","v":""},39,"2025-10-26",45956,"2025-10-26",{"$f":"IFERROR(VLOOKUP(BD29,Feiertage!$A$3:$B$29,2,FALSE),\"\")","v":""},{"$f":"IFERROR(VLOOKUP(BD29,Mondphasen!$G$23:$H$36,2,FALSE),\"\")","v":""},43,"2025-11-26",45987,"2025-11-26",{"$f":"IFERROR(VLOOKUP(BJ29,Feiertage!$A$3:$B$29,2,FALSE),\"\")","v":""},{"$f":"IFERROR(VLOOKUP(BJ29,Mondphasen!$G$23:$H$36,2,FALSE),\"\")","v":""},48,"2025-12-26",46017,"2025-12-26",{"$f":"IFERROR(VLOOKUP(BP29,Feiertage!$A$3:$B$29,2,FALSE),\"\")","v":"Stephanstag"},{"$f":"IFERROR(VLOOKUP(BP29,Mondphasen!$G$23:$H$36,2,FALSE),\"\")","v":""},52]
["2025-01-27",45684,"2025-01-27",{"$f":"IFERROR(VLOOKUP(B30,Feiertage!$A$3:$B$29,2,FALSE),\"\")","v":""},{"$f":"IFERROR(VLOOKUP(B30,Mondphasen!$G$23:$H$36,2,FALSE),\"\")","v":""},5,"2025-02-27",45715,"2025-02-27",{"$f":"IFERROR(VLOOKUP(H30,Feiertage!$A$3:$B$29,2,FALSE),\"\")","v":""},{"$f":"IFERROR(VLOOKUP(H30,Mondphasen!$G$23:$H$36,2,FALSE),\"\")","v":""},9,"2025-03-27",45743,"2025-03-27",{"$f":"IFERROR(VLOOKUP(N30,Feiertage!$A$3:$B$29,2,FALSE),\"\")","v":""},{"$f":"IFERROR(VLOOKUP(N30,Mondphasen!$G$23:$H$36,2,FALSE),\"\")","v":""},13,"2025-04-27",45774,"2025-04-27",{"$f":"IFERROR(VLOOKUP(T30,Feiertage!$A$3:$B$29,2,FALSE),\"\")","v":""},{"$f":"IFERROR(VLOOKUP(T30,Mondphasen!$G$23:$H$36,2,FALSE),\"\")","v":""},17,"2025-05-27",45804,"2025-05-27",{"$f":"IFERROR(VLOOKUP(Z30,Feiertage!$A$3:$B$29,2,FALSE),\"\")","v":""},{"$f":"IFERROR(VLOOKUP(Z30,Mondphasen!$G$23:$H$36,2,FALSE),\"\")","v":""},22,"2025-06-27",45835,"2025-06-27",{"$f":"IFERROR(VLOOKUP(AF30,Feiertage!$A$3:$B$29,2,FALSE),\"\")","v":""},{"$f":"IFERROR(VLOOKUP(AF30,Mondphasen!$G$23:$H$36,2,FALSE),\"\")","v":""},26,"2025-07-27",45865,"2025-07-27",{"$f":"IFERROR(VLOOKUP(AL30,Feiertage!$A$3:$B$29,2,FALSE),\"\")","v":""},{"$f":"IFERROR(VLOOKUP(AL30,Mondphasen!$G$23:$H$36,2,FALSE),\"\")","v":""},30,"2025-08-27",45896,"2025-08-27",{"$f":"IFERROR(VLOOKUP(AR30,Feiertage!$A$3:$B$29,2,FALSE),\"\")","v":""},{"$f":"IFERROR(VLOOKUP(AR30,Mondphasen!$G$23:$H$36,2,FALSE),\"\")","v":""},35,"2025-09-27",45927,"2025-09-27",{"$f":"IFERROR(VLOOKUP(AX30,Feiertage!$A$3:$B$29,2,FALSE),\"\")","v":""},{"$f":"IFERROR(VLOOKUP(AX30,Mondphasen!$G$23:$H$36,2,FALSE),\"\")","v":""},39,"2025-10-27",45957,"2025-10-27",{"$f":"IFERROR(VLOOKUP(BD30,Feiertage!$A$3:$B$29,2,FALSE),\"\")","v":""},{"$f":"IFERROR(VLOOKUP(BD30,Mondphasen!$G$23:$H$36,2,FALSE),\"\")","v":""},44,"2025-11-27",45988,"2025-11-27",{"$f":"IFERROR(VLOOKUP(BJ30,Feiertage!$A$3:$B$29,2,FALSE),\"\")","v":""},{"$f":"IFERROR(VLOOKUP(BJ30,Mondphasen!$G$23:$H$36,2,FALSE),\"\")","v":""},48,"2025-12-27",46018,"2025-12-27",{"$f":"IFERROR(VLOOKUP(BP30,Feiertage!$A$3:$B$29,2,FALSE),\"\")","v":""},{"$f":"IFERROR(VLOOKUP(BP30,Mondphasen!$G$23:$H$36,2,FALSE),\"\")","v":""},52]
["2025-01-28",45685,"2025-01-28",{"$f":"IFERROR(VLOOKUP(B31,Feiertage!$A$3:$B$29,2,FALSE),\"\")","v":""},{"$f":"IFERROR(VLOOKUP(B31,Mondphasen!$G$23:$H$36,2,FALSE),\"\")","v":""},5,"2025-02-28",45716,"2025-02-28",{"$f":"IFERROR(VLOOKUP(H31,Feiertage!$A$3:$B$29,2,FALSE),\"\")","v":""},{"$f":"IFERROR(VLOOKUP(H31,Mondphasen!$G$23:$H$36,2,FALSE),\"\")","v":""},9,"2025-03-28",45744,"2025-03-28",{"$f":"IFERROR(VLOOKUP(N31,Feiertage!$A$3:$B$29,2,FALSE),\"\")","v":""},{"$f":"IFERROR(VLOOKUP(N31,Mondphasen!$G$23:$H$36,2,FALSE),\"\")","v":""},13,"2025-04-28",45775,"2025-04-28",{"$f":"IFERROR(VLOOKUP(T31,Feiertage!$A$3:$B$29,2,FALSE),\"\")","v":""},{"$f":"IFERROR(VLOOKUP(T31,Mondphasen!$G$23:$H$36,2,FALSE),\"\")","v":""},18,"2025-05-28",45805,"2025-05-28",{"$f":"IFERROR(VLOOKUP(Z31,Feiertage!$A$3:$B$29,2,FALSE),\"\")","v":""},{"$f":"IFERROR(VLOOKUP(Z31,Mondphasen!$G$23:$H$36,2,FALSE),\"\")","v":""},22,"2025-06-28",45836,"2025-06-28",{"$f":"IFERROR(VLOOKUP(AF31,Feiertage!$A$3:$B$29,2,FALSE),\"\")","v":""},{"$f":"IFERROR(VLOOKUP(AF31,Mondphasen!$G$23:$H$36,2,FALSE),\"\")","v":""},26,"2025-07-28",45866,"2025-07-28",{"$f":"IFERROR(VLOOKUP(AL31,Feiertage!$A$3:$B$29,2,FALSE),\"\")","v":""},{"$f":"IFERROR(VLOOKUP(AL31,Mondphasen!$G$23:$H$36,2,FALSE),\"\")","v":""},31,"2025-08-28",45897,"2025-08-28",{"$f":"IFERROR(VLOOKUP(AR31,Feiertage!$A$3:$B$29,2,FALSE),\"\")","v":""},{"$f":"IFERROR(VLOOKUP(AR31,Mondphasen!$G$23:$H$36,2,FALSE),\"\")","v":""},35,"2025-09-28",45928,"2025-09-28",{"$f":"IFERROR(VLOOKUP(AX31,Feiertage!$A$3:$B$29,2,FALSE),\"\")","v":""},{"$f":"IFERROR(VLOOKUP(AX31,Mondphasen!$G$23:$H$36,2,FALSE),\"\")","v":""},39,"2025-10-28",45958,"2025-10-28",{"$f":"IFERROR(VLOOKUP(BD31,Feiertage!$A$3:$B$29,2,FALSE),\"\")","v":""},{"$f":"IFERROR(VLOOKUP(BD31,Mondphasen!$G$23:$H$36,2,FALSE),\"\")","v":""},44,"2025-11-28",45989,"2025-11-28",{"$f":"IFERROR(VLOOKUP(BJ31,Feiertage!$A$3:$B$29,2,FALSE),\"\")","v":""},{"$f":"IFERROR(VLOOKUP(BJ31,Mondphasen!$G$23:$H$36,2,FALSE),\"\")","v":""},48,"2025-12-28",46019,"2025-12-28",{"$f":"IFERROR(VLOOKUP(BP31,Feiertage!$A$3:$B$29,2,FALSE),\"\")","v":""},{"$f":"IFERROR(VLOOKUP(BP31,Mondphasen!$G$23:$H$36,2,FALSE),\"\")","v":""},52]
["2025-01-29",45686,"2025-01-29",{"$f":"IFERROR(VLOOKUP(B32,Feiertage!$A$3:$B$29,2,FALSE),\"\")","v":""},{"$f":"IFERROR(VLOOKUP(B32,Mondphasen!$G$23:$H$36,2,FALSE),\"\")","v":""},5,"","","",{"$f":"IFERROR(VLOOKUP(H32,Feiertage!$A$3:$B$29,2,FALSE),\"\")","v":""},{"$f":"IFERROR(VLOOKUP(H32,Mondphasen!$G$23:$H$36,2,FALSE),\"\")","v":""},"","2025-03-29",45745,"2025-03-29",{"$f":"IFERROR(VLOOKUP(N32,Feiertage!$A$3:$B$29,2,FALSE),\"\")","v":""},{"$f":"IFERROR(VLOOKUP(N32,Mondphasen!$G$23:$H$36,2,FALSE),\"\")","v":""},13,"2025-04-29",45776,"2025-04-29",{"$f":"IFERROR(VLOOKUP(T32,Feiertage!$A$3:$B$29,2,FALSE),\"\")","v":""},{"$f":"IFERROR(VLOOKUP(T32,Mondphasen!$G$23:$H$36,2,FALSE),\"\")","v":""},18,"2025-05-29",45806,"2025-05-29",{"$f":"IFERROR(VLOOKUP(Z32,Feiertage!$A$3:$B$29,2,FALSE),\"\")","v":"Auffahrt"},{"$f":"IFERROR(VLOOKUP(Z32,Mondphasen!$G$23:$H$36,2,FALSE),\"\")","v":""},22,"2025-06-29",45837,"2025-06-29",{"$f":"IFERROR(VLOOKUP(AF32,Feiertage!$A$3:$B$29,2,FALSE),\"\")","v":""},{"$f":"IFERROR(VLOOKUP(AF32,Mondphasen!$G$23:$H$36,2,FALSE),\"\")","v":""},26,"2025-07-29",45867,"2025-07-29",{"$f":"IFERROR(VLOOKUP(AL32,Feiertage!$A$3:$B$29,2,FALSE),\"\")","v":""},{"$f":"IFERROR(VLOOKUP(AL32,Mondphasen!$G$23:$H$36,2,FALSE),\"\")","v":""},31,"2025-08-29",45898,"2025-08-29",{"$f":"IFERROR(VLOOKUP(AR32,Feiertage!$A$3:$B$29,2,FALSE),\"\")","v":""},{"$f":"IFERROR(VLOOKUP(AR32,Mondphasen!$G$23:$H$36,2,FALSE),\"\")","v":""},35,"2025-09-29",45929,"2025-09-29",{"$f":"IFERROR(VLOOKUP(AX32,Feiertage!$A$3:$B$29,2,FALSE),\"\")","v":""},{"$f":"IFERROR(VLOOKUP(AX32,Mondphasen!$G$23:$H$36,2,FALSE),\"\")","v":""},40,"2025-10-29",45959,"2025-10-29",{"$f":"IFERROR(VLOOKUP(BD32,Feiertage!$A$3:$B$29,2,FALSE),\"\")","v":""},{"$f":"IFERROR(VLOOKUP(BD32,Mondphasen!$G$23:$H$36,2,FALSE),\"\")","v":""},44,"2025-11-29",45990,"2025-11-29",{"$f":"IFERROR(VLOOKUP(BJ32,Feiertage!$A$3:$B$29,2,FALSE),\"\")","v":""},{"$f":"IFERROR(VLOOKUP(BJ32,Mondphasen!$G$23:$H$36,2,FALSE),\"\")","v":""},48,"2025-12-29",46020,"2025-12-29",{"$f":"IFERROR(VLOOKUP(BP32,Feiertage!$A$3:$B$29,2,FALSE),\"\")","v":""},{"$f":"IFERROR(VLOOKUP(BP32,Mondphasen!$G$23:$H$36,2,FALSE),\"\")","v":""},1]
["2025-01-30",45687,"2025-01-30",{"$f":"IFERROR(VLOOKUP(B33,Feiertage!$A$3:$B$29,2,FALSE),\"\")","v":""},{"$f":"IFERROR(VLOOKUP(B33,Mondphasen!$G$23:$H$36,2,FALSE),\"\")","v":""},5,"","","",{"$f":"IFERROR(VLOOKUP(H33,Feiertage!$A$3:$B$29,2,FALSE),\"\")","v":""},{"$f":"IFERROR(VLOOKUP(H33,Mondphasen!$G$23:$H$36,2,FALSE),\"\")","v":""},"","2025-03-30",45746,"2025-03-30",{"$f":"IFERROR(VLOOKUP(N33,Feiertage!$A$3:$B$29,2,FALSE),\"\")","v":""},{"$f":"IFERROR(VLOOKUP(N33,Mondphasen!$G$23:$H$36,2,FALSE),\"\")","v":""},13,"2025-04-30",45777,"2025-04-30",{"$f":"IFERROR(VLOOKUP(T33,Feiertage!$A$3:$B$29,2,FALSE),\"\")","v":""},{"$f":"IFERROR(VLOOKUP(T33,Mondphasen!$G$23:$H$36,2,FALSE),\"\")","v":""},18,"2025-05-30",45807,"2025-05-30",{"$f":"IFERROR(VLOOKUP(Z33,Feiertage!$A$3:$B$29,2,FALSE),\"\")","v":""},{"$f":"IFERROR(VLOOKUP(Z33,Mondphasen!$G$23:$H$36,2,FALSE),\"\")","v":""},22,"2025-06-30",45838,"2025-06-30",{"$f":"IFERROR(VLOOKUP(AF33,Feiertage!$A$3:$B$29,2,FALSE),\"\")","v":""},{"$f":"IFERROR(VLOOKUP(AF33,Mondphasen!$G$23:$H$36,2,FALSE),\"\")","v":""},27,"2025-07-30",45868,"2025-07-30",{"$f":"IFERROR(VLOOKUP(AL33,Feiertage!$A$3:$B$29,2,FALSE),\"\")","v":""},{"$f":"IFERROR(VLOOKUP(AL33,Mondphasen!$G$23:$H$36,2,FALSE),\"\")","v":""},31,"2025-08-30",45899,"2025-08-30",{"$f":"IFERROR(VLOOKUP(AR33,Feiertage!$A$3:$B$29,2,FALSE),\"\")","v":""},{"$f":"IFERROR(VLOOKUP(AR33,Mondphasen!$G$23:$H$36,2,FALSE),\"\")","v":""},35,"2025-09-30",45930,"2025-09-30",{"$f":"IFERROR(VLOOKUP(AX33,Feiertage!$A$3:$B$29,2,FALSE),\"\")","v":""},{"$f":"IFERROR(VLOOKUP(AX33,Mondphasen!$G$23:$H$36,2,FALSE),\"\")","v":""},40,"2025-10-30",45960,"2025-10-30",{"$f":"IFERROR(VLOOKUP(BD33,Feiertage!$A$3:$B$29,2,FALSE),\"\")","v":""},{"$f":"IFERROR(VLOOKUP(BD33,Mondphasen!$G$23:$H$36,2,FALSE),\"\")","v":""},44,"2025-11-30",45991,"2025-11-30",{"$f":"IFERROR(VLOOKUP(BJ33,Feiertage!$A$3:$B$29,2,FALSE),\"\")","v":""},{"$f":"IFERROR(VLOOKUP(BJ33,Mondphasen!$G$23:$H$36,2,FALSE),\"\")","v":""},48,"2025-12-30",46021,"2025-12-30",{"$f":"IFERROR(VLOOKUP(BP33,Feiertage!$A$3:$B$29,2,FALSE),\"\")","v":""},{"$f":"IFERROR(VLOOKUP(BP33,Mondphasen!$G$23:$H$36,2,FALSE),\"\")","v":""},1]
["2025-01-31",45688,"2025-01-31",{"$f":"IFERROR(VLOOKUP(B34,Feiertage!$A$3:$B$29,2,FALSE),\"\")","v":""},{"$f":"IFERROR(VLOOKUP(B34,Mondphasen!$G$23:$H$36,2,FALSE),\"\")","v":""},5,"","","",{"$f":"IFERROR(VLOOKUP(H34,Feiertage!$A$3:$B$29,2,FALSE),\"\")","v":""},{"$f":"IFERROR(VLOOKUP(H34,Mondphasen!$G$23:$H$36,2,FALSE),\"\")","v":""},"","2025-03-31",45747,"2025-03-31",{"$f":"IFERROR(VLOOKUP(N34,Feiertage!$A$3:$B$29,2,FALSE),\"\")","v":""},{"$f":"IFERROR(VLOOKUP(N34,Mondphasen!$G$23:$H$36,2,FALSE),\"\")","v":""},14,"","","",{"$f":"IFERROR(VLOOKUP(T34,Feiertage!$A$3:$B$29,2,FALSE),\"\")","v":""},{"$f":"IFERROR(VLOOKUP(T34,Mondphasen!$G$23:$H$36,2,FALSE),\"\")","v":""},"","2025-05-31",45808,"2025-05-31",{"$f":"IFERROR(VLOOKUP(Z34,Feiertage!$A$3:$B$29,2,FALSE),\"\")","v":""},{"$f":"IFERROR(VLOOKUP(Z34,Mondphasen!$G$23:$H$36,2,FALSE),\"\")","v":""},22,"","","",{"$f":"IFERROR(VLOOKUP(AF34,Feiertage!$A$3:$B$29,2,FALSE),\"\")","v":""},{"$f":"IFERROR(VLOOKUP(AF34,Mondphasen!$G$23:$H$36,2,FALSE),\"\")","v":""},"","2025-07-31",45869,"2025-07-31",{"$f":"IFERROR(VLOOKUP(AL34,Feiertage!$A$3:$B$29,2,FALSE),\"\")","v":""},{"$f":"IFERROR(VLOOKUP(AL34,Mondphasen!$G$23:$H$36,2,FALSE),\"\")","v":""},31,"2025-08-31",45900,"2025-08-31",{"$f":"IFERROR(VLOOKUP(AR34,Feiertage!$A$3:$B$29,2,FALSE),\"\")","v":""},{"$f":"IFERROR(VLOOKUP(AR34,Mondphasen!$G$23:$H$36,2,FALSE),\"\")","v":""},35,"","","",{"$f":"IFERROR(VLOOKUP(AX34,Feiertage!$A$3:$B$29,2,FALSE),\"\")","v":""},{"$f":"IFERROR(VLOOKUP(AX34,Mondphasen!$G$23:$H$36,2,FALSE),\"\")","v":""},"","2025-10-31",45961,"2025-10-31",{"$f":"IFERROR(VLOOKUP(BD34,Feiertage!$A$3:$B$29,2,FALSE),\"\")","v":""},{"$f":"IFERROR(VLOOKUP(BD34,Mondphasen!$G$23:$H$36,2,FALSE),\"\")","v":""},44,"","","",{"$f":"IFERROR(VLOOKUP(BJ34,Feiertage!$A$3:$B$29,2,FALSE),\"\")","v":""},{"$f":"IFERROR(VLOOKUP(BJ34,Mondphasen!$G$23:$H$36,2,FALSE),\"\")","v":""},"","2025-12-31",46022,"2025-12-31",{"$f":"IFERROR(VLOOKUP(BP34,Feiertage!$A$3:$B$29,2,FALSE),\"\")","v":"Silvester"},{"$f":"IFERROR(VLOOKUP(BP34,Mondphasen!$G$23:$H$36,2,FALSE),\"\")","v":""},1]

{"sheet":"Feiertage","index":1,"n_rows":29,"n_cols":16,"rows_kept":29,"cut":false,"hidden":false,"merged":[[1,1,1,3]]}
[{"$f":"IF(COUNTIF($P$3:$P$28,$A$2),\"Schaltjahr\",\"\")","v":""}]
[{"$f":"YEAR(Kalender!A4)","v":2025},{"$f":"A2","v":2025},null,null,"Gesetzlicher\nFeiertag",null,null,null,null,null,null,null,null,null,null,"Schaltjahre"]
[null,null,null,null,null,null,null,null,null,null,null,null,null,null,null,2016]
[{"$f":"C4","v":45658},"Neujahr",{"$f":"DATE(B2,1,1)","v":"2025-01-01"},{"$f":"WEEKDAY(C4,1)","v":"1900-01-04"},"Ja",null,{"$f":"I4","v":45658},"Neujahr",{"$f":"DATE($B$2,1,1)","v":"2025-01-01"},{"$f":"WEEKDAY(I4,1)","v":"1900-01-04"},"Ja",null,null,null,null,{"$f":"P3+4","v":2020}]
[45659,"Berchtoldstag",{"$f":"DATE(B2,1,2)","v":"2025-01-02"},"1900-01-05","Ja",null,45659,"Berchtoldstag",{"$f":"DATE($B$2,1,2)","v":"2025-01-02"},"1900-01-05","Ja",null,null,null,null,{"$f":"P4+4","v":2024}]
[45663,"Heilige drei Könige",{"$f":"DATE(B2,1,6)","v":"2025-01-06"},"1900-01-02",null,null,null,null,null,null,null,null,null,null,null,2028]
[45719,"Fasnacht-Montag",{"$f":"C13-48","v":"2025-03-03"},"1900-01-02",null,null,null,null,null,null,null,null,null,null,null,2032]
[45720,"Fasnacht-Dienstag",{"$f":"C13-47","v":"2025-03-04"},"1900-01-03",null,null,null,null,null,null,null,null,null,null,null,2036]
[45721,"Aschermittwoch",{"$f":"C13-46","v":"2025-03-05"},"1900-01-04",null,null,null,null,null,null,null,null,null,null,null,2040]
[45760,"Palmsonntag",{"$f":"C13-7","v":"2025-04-13"},"1900-01-01",null,null,null,null,null,null,null,null,null,null,null,2044]
[45764,"Grün-Donnerstag",{"$f":"C13-3","v":"2025-04-17"},"1900-01-05",null,null,null,null,null,null,null,null,null,null,null,2048]
[45765,"Karfreitag",{"$f":"C13-2","v":"2025-04-18"},"1900-01-06","Ja",null,45765,"Karfreitag",{"$f":"L13-2","v":"2025-04-18"},"1900-01-06","Ja",null,null,null,null,2052]
[45767,"Ostersonntag",{"$f":"ROUND((DAY(MINUTE(B2/38)/2+55)&\".4.\"&B2)/7,)*7-6","v":"2025-04-20"},"1900-01-01",null,null,{"$f":"L13","v":45767},"Ostersonntag",null,{"$f":"WEEKDAY(L13,1)","v":"1900-01-01"},null,{"$f":"ROUND((DAY(MINUTE($B$2/38)/2+55)&\".4.\"&$B$2)/7,)*7-6","v":"2025-04-20"},null,null,null,2056]
[45768,"Ostermontag",{"$f":"C13+1","v":"2025-04-21"},"1900-01-02","Ja",null,45768,"Ostermontag",{"$f":"L13+1","v":"2025-04-21"},"1900-01-02","Ja",null,null,null,null,2060]
[45778,"Tag der Arbeit",{"$f":"DATE(B2,5,1)","v":"2025-05-01"},"1900-01-05",null,null,null,null,null,null,null,null,null,null,null,2064]
[{"$f":"C16","v":45788},"Muttertag",{"$f":"C15+14-WEEKDAY(C15,2)","v":"2025-05-11"},{"$f":"WEEKDAY(C16,1)","v":"1900-01-01"},null,null,null,null,null,null,null,null,null,null,null,2068]
[45806,"Auffahrt",{"$f":"C13+39","v":"2025-05-29"},"1900-01-05","Ja",null,45806,"Auffahrt",{"$f":"L13+39","v":"2025-05-29"},"1900-01-05","Ja",null,null,null,null,2072]
[45816,"Pfingsten",{"$f":"C13+49","v":"2025-06-08"},"1900-01-01",null,null,null,null,null,null,null,null,null,null,null,2076]
[45817,"Pfingst-Montag",{"$f":"C13+50","v":"2025-06-09"},"1900-01-02","Ja",null,45817,"Pfingst-Montag",{"$f":"L13+50","v":"2025-06-09"},"1900-01-02","Ja",null,null,null,null,2080]
[{"$f":"C20","v":45827},"Fronleichnam",{"$f":"C13+60","v":"2025-06-19"},{"$f":"WEEKDAY(C20,1)","v":"1900-01-05"},null,null,null,null,null,null,null,null,null,null,null,2084]
[45870,"National-Feiertag CH",{"$f":"DATE(B2,8,1)","v":"2025-08-01"},"1900-01-06","Ja",null,{"$f":"I21","v":45870},"National-Feiertag CH",{"$f":"DATE($B$2,8,1)","v":"2025-08-01"},"1900-01-06","Ja",null,null,null,null,2088]
[45884,"Maria-Himmelfahrt",{"$f":"DATE(B2,8,15)","v":"2025-08-15"},"1900-01-06",null,null,null,null,null,null,null,null,null,null,null,2092]
[{"$f":"C23","v":45921},"Eidg. Buss und Bettag",{"$f":"DATE($A$2,9,1)+21-WEEKDAY(DATE($A$2,9,1),2)","v":"2025-09-21"},{"$f":"WEEKDAY(C23,1)","v":"1900-01-01"},"Ja",null,45921,"Eidg. Buss und Bettag",{"$f":"DATE($A$2,9,1)+21-WEEKDAY(DATE($A$2,9,1),2)","v":"2025-09-21"},"1900-01-01","Ja",null,null,null,null,2096]
[45997,"Samichlaus",{"$f":"DATE(B2,12,6)","v":"2025-12-06"},"1900-01-07",null,null,null,null,null,null,null,null,null,null,null,{"$f":"P23+4","v":2100}]
[45962,"Allerheiligen",{"$f":"DATE(B2,11,1)","v":"2025-11-01"},"1900-01-07"]
[46015,"Heilig Abend",{"$f":"DATE(B2,12,24)","v":"2025-12-24"},"1900-01-04"]
[46016,"Weihnachten",{"$f":"DATE(B2,12,25)","v":"2025-12-25"},"1900-01-05","Ja",null,46016,"Weihnachten",{"$f":"DATE($B$2,12,25)","v":"2025-12-25"},"1900-01-05","Ja"]
[46017,"Stephanstag",{"$f":"DATE(B2,12,26)","v":"2025-12-26"},"1900-01-06","Ja",null,46017,"Stephanstag",{"$f":"DATE($B$2,12,26)","v":"2025-12-26"},"1900-01-06","Ja"]
[46022,"Silvester",{"$f":"DATE(B2,12,31)","v":"2025-12-31"},"1900-01-04"]

{"sheet":"Mondphasen","index":2,"n_rows":36,"n_cols":8,"rows_kept":36,"cut":false,"hidden":false,"merged":[]}
["Jahr : ",{"$f":"Kalender!L1","v":2025}]
["Zeitzone : ",2]
[]
["Neumond"," erstes Viertel","Vollmond","letztes Viertel"]
[{"$f":"Tabelle!H1-2415018.5+Mondphasen!$B$2/24","v":"2024-12-31T00:29:33.340"},{"$f":"Tabelle!H2-2415018.5+Mondphasen!$B$2/24","v":"2025-01-07T01:58:30.509"},{"$f":"Tabelle!H3-2415018.5+Mondphasen!$B$2/24","v":"2025-01-14T00:28:03.460"},{"$f":"Tabelle!H4-2415018.5+Mondphasen!$B$2/24","v":"2025-01-21T22:29:46.106"}]
[{"$f":"Tabelle!H5-2415018.5+Mondphasen!$B$2/24","v":"2025-01-29T14:38:52.321"},{"$f":"Tabelle!H6-2415018.5+Mondphasen!$B$2/24","v":"2025-02-05T10:05:46.114"},{"$f":"Tabelle!H7-2415018.5+Mondphasen!$B$2/24","v":"2025-02-12T15:56:28.619"},{"$f":"Tabelle!H8-2415018.5+Mondphasen!$B$2/24","v":"2025-02-20T19:32:58.370"}]
[{"$f":"Tabelle!H9-2415018.5+Mondphasen!$B$2/24","v":"2025-02-28T02:45:29.318"},{"$f":"Tabelle!H10-2415018.5+Mondphasen!$B$2/24","v":"2025-03-06T18:34:49.193"},{"$f":"Tabelle!H11-2415018.5+Mondphasen!$B$2/24","v":"2025-03-14T08:56:52.486"},{"$f":"Tabelle!H12-2415018.5+Mondphasen!$B$2/24","v":"2025-03-22T13:34:05.249"}]
[{"$f":"Tabelle!H13-2415018.5+Mondphasen!$B$2/24","v":"2025-03-29T12:57:50.390"},{"$f":"Tabelle!H14-2415018.5+Mondphasen!$B$2/24","v":"2025-04-05T04:16:55.303"},{"$f":"Tabelle!H15-2415018.5+Mondphasen!$B$2/24","v":"2025-04-13T02:22:41.046"},{"$f":"Tabelle!H16-2415018.5+Mondphasen!$B$2/24","v":"2025-04-21T03:40:28.997"}]
[{"$f":"Tabelle!H17-2415018.5+Mondphasen!$B$2/24","v":"2025-04-27T21:33:08.887"},{"$f":"Tabelle!H18-2415018.5+Mondphasen!$B$2/24","v":"2025-05-04T15:54:20.625"},{"$f":"Tabelle!H19-2415018.5+Mondphasen!$B$2/24","v":"2025-05-12T18:57:03.248"},{"$f":"Tabelle!H20-2415018.5+Mondphasen!$B$2/24","v":"2025-05-20T14:00:43.517"}]
[{"$f":"Tabelle!H21-2415018.5+Mondphasen!$B$2/24","v":"2025-05-27T05:05:33.879"},{"$f":"Tabelle!H22-2415018.5+Mondphasen!$B$2/24","v":"2025-06-03T05:44:09.159"},{"$f":"Tabelle!H23-2415018.5+Mondphasen!$B$2/24","v":"2025-06-11T09:46:41.265"},{"$f":"Tabelle!H24-2415018.5+Mondphasen!$B$2/24","v":"2025-06-18T21:20:18.554"}]
[{"$f":"Tabelle!H25-2415018.5+Mondphasen!$B$2/24","v":"2025-06-25T12:33:28.033"},{"$f":"Tabelle!H26-2415018.5+Mondphasen!$B$2/24","v":"2025-07-02T21:32:17.992"},{"$f":"Tabelle!H27-2415018.5+Mondphasen!$B$2/24","v":"2025-07-10T22:39:23.870"},{"$f":"Tabelle!H28-2415018.5+Mondphasen!$B$2/24","v":"2025-07-18T02:40:49.322"}]
[{"$f":"Tabelle!H29-2415018.5+Mondphasen!$B$2/24","v":"2025-07-24T21:11:38.008"},{"$f":"Tabelle!H30-2415018.5+Mondphasen!$B$2/24","v":"2025-08-01T14:41:34.201"},{"$f":"Tabelle!H31-2415018.5+Mondphasen!$B$2/24","v":"2025-08-09T09:56:08.386"},{"$f":"Tabelle!H32-2415018.5+Mondphasen!$B$2/24","v":"2025-08-16T07:15:42.909"}]
[{"$f":"Tabelle!H33-2415018.5+Mondphasen!$B$2/24","v":"2025-08-23T08:07:40.192"},{"$f":"Tabelle!H34-2415018.5+Mondphasen!$B$2/24","v":"2025-08-31T08:25:11.721"},{"$f":"Tabelle!H35-2415018.5+Mondphasen!$B$2/24","v":"2025-09-07T20:09:36.200"},{"$f":"Tabelle!H36-2415018.5+Mondphasen!$B$2/24","v":"2025-09-14T12:33:47.990"}]
[{"$f":"Tabelle!H37-2415018.5+Mondphasen!$B$2/24","v":"2025-09-21T21:56:19.302"},{"$f":"Tabelle!H38-2415018.5+Mondphasen!$B$2/24","v":"2025-09-30T01:55:06.199"},{"$f":"Tabelle!H39-2415018.5+Mondphasen!$B$2/24","v":"2025-10-07T05:49:13.925"},{"$f":"Tabelle!H40-2415018.5+Mondphasen!$B$2/24","v":"2025-10-13T20:11:50.595"}]
[{"$f":"Tabelle!H41-2415018.5+Mondphasen!$B$2/24","v":"2025-10-21T14:26:52.901"},{"$f":"Tabelle!H42-2415018.5+Mondphasen!$B$2/24","v":"2025-10-29T18:22:36.173"},{"$f":"Tabelle!H43-2415018.5+Mondphasen!$B$2/24","v":"2025-11-05T15:21:15.826"},{"$f":"Tabelle!H44-2415018.5+Mondphasen!$B$2/24","v":"2025-11-12T07:28:43.735"}]
[{"$f":"Tabelle!H45-2415018.5+Mondphasen!$B$2/24","v":"2025-11-20T08:48:12.461"},{"$f":"Tabelle!H46-2415018.5+Mondphasen!$B$2/24","v":"2025-11-28T08:59:54.561"},{"$f":"Tabelle!H47-2415018.5+Mondphasen!$B$2/24","v":"2025-12-05T01:15:20.279"},{"$f":"Tabelle!H48-2415018.5+Mondphasen!$B$2/24","v":"2025-12-11T22:53:32.667"}]
[{"$f":"Tabelle!H49-2415018.5+Mondphasen!$B$2/24","v":"2025-12-20T03:44:35.240"},{"$f":"Tabelle!H50-2415018.5+Mondphasen!$B$2/24","v":"2025-12-27T21:11:06.544"},{"$f":"Tabelle!H51-2415018.5+Mondphasen!$B$2/24","v":"2026-01-03T12:03:54.095"},{"$f":"Tabelle!H52-2415018.5+Mondphasen!$B$2/24","v":"2026-01-10T17:49:10.327"}]
[{"$f":"Tabelle!H53-2415018.5+Mondphasen!$B$2/24","v":"2026-01-18T21:53:38.343"},{"$f":"Tabelle!H54-2415018.5+Mondphasen!$B$2/24","v":"2026-01-26T06:49:53.353"},{"$f":"Tabelle!H55-2415018.5+Mondphasen!$B$2/24","v":"2026-02-02T00:10:58.065"},{"$f":"Tabelle!H56-2415018.5+Mondphasen!$B$2/24","v":"2026-02-09T14:43:19.490"}]
[]
[]
[]
["Neumond"," erstes Viertel","Vollmond","letztes Viertel",null,null,"Vollmond"]
[{"$f":"TRUNC(A5)","v":"2024-12-31"},{"$f":"TRUNC(B5)","v":"2025-01-07"},"2025-01-14","2025-01-21",null,"O",{"$f":"C23","v":45671},"l"]
[{"$f":"TRUNC(A6)","v":"2025-01-29"},"2025-02-05","2025-02-12","2025-02-20",null,null,45700,"l"]
[{"$f":"TRUNC(A7)","v":"2025-02-28"},"2025-03-06","2025-03-14","2025-03-22",null,null,45730,"l"]
[{"$f":"TRUNC(A8)","v":"2025-03-29"},"2025-04-05","2025-04-13","2025-04-21",null,null,45760,"l"]
[{"$f":"TRUNC(A9)","v":"2025-04-27"},"2025-05-04","2025-05-12","2025-05-20",null,null,45789,"l"]
[{"$f":"TRUNC(A10)","v":"2025-05-27"},"2025-06-03","2025-06-11","2025-06-18",null,null,45819,"l"]
[{"$f":"TRUNC(A11)","v":"2025-06-25"},"2025-07-02","2025-07-10","2025-07-18",null,null,{"$f":"C29","v":45848},"l"]
[{"$f":"TRUNC(A12)","v":"2025-07-24"},"2025-08-01","2025-08-09","2025-08-16",null,null,45878,"l"]
[{"$f":"TRUNC(A13)","v":"2025-08-23"},"2025-08-31","2025-09-07","2025-09-14",null,null,45907,"l"]
[{"$f":"TRUNC(A14)","v":"2025-09-21"},"2025-09-30","2025-10-07","2025-10-13",null,null,45937,"l"]
[{"$f":"TRUNC(A15)","v":"2025-10-21"},"2025-10-29","2025-11-05","2025-11-12",null,null,45966,"l"]
[{"$f":"TRUNC(A16)","v":"2025-11-20"},"2025-11-28","2025-12-05","2025-12-11",null,null,45996,"l"]
[{"$f":"TRUNC(A17)","v":"2025-12-20"},"2025-12-27","2026-01-03","2026-01-10",null,null,46025,"l"]
[{"$f":"TRUNC(A18)","v":"2026-01-18"},"2026-01-26","2026-02-02","2026-02-09",null,null,{"$f":"C36","v":46055},"l"]

{"sheet":"Tabelle","index":3,"n_rows":56,"n_cols":8,"rows_kept":56,"cut":false,"hidden":false,"merged":[]}
[{"$f":"Mondphasen!B1","v":2025},0,{"$f":"INT((A1-2000)*12.3685)+B1","v":309},{"$f":"2451550.09766+29.530588861*C1","v":2460675.0496180491},{"$f":"(2.5534+29.1053567*C1)*PI()/180","v":157.01171529127942},{"$f":"(201.5643+385.81693528*C1)*PI()/180","v":2084.2546923417476},{"$f":"(160.7108+390.67050284*C1)*PI()/180","v":2109.7172811822902},{"$f":"-0.4072*SIN(F1)+0.17241*SIN(E1)+0.01608*SIN(2*F1)+0.01039*SIN(2*G1)+0.00739*SIN(F1-E1)-0.00514*SIN(F1+E1)+0.00208*SIN(2*E1)-0.00111*SIN(F1-2*G1)+D1","v":2460675.4371914379}]
[{"$f":"A1","v":2025},0.25,309.25,2460682.4322652644,157.13871136737498,2085.938136299395,2111.4219028235352,{"$f":"-0.62801*SIN(F2)+0.17172*SIN(E2)-0.01183*SIN(F2+E2)+0.00862*SIN(2*F2)+0.00804*SIN(2*G2)+0.00454*SIN(F2-E2)+0.00204*SIN(2*E2)-0.0018*SIN(F2-2*G2)+D2+0.00306","v":2460682.4989642273}]
[{"$f":"A2","v":2025},0.5,309.5,2460689.8149124794,157.2657074434706,2087.6215802570428,2113.1265244647798,{"$f":"-0.40614*SIN(F3)+0.17302*SIN(E3)+0.01614*SIN(2*F3)+0.01043*SIN(2*G3)+0.00734*SIN(F3-E3)-0.00515*SIN(F3+E3)+0.00209*SIN(2*E3)-0.00111*SIN(F3-2*G3)+D3","v":2460689.4361511618}]
[{"$f":"A3","v":2025},0.75,309.75,2460697.1975596948,157.3927035195662,2089.3050242146901,2114.8311461060248,{"$f":"-0.62801*SIN(F4)+0.17172*SIN(E4)-0.01183*SIN(F4+E4)+0.00862*SIN(2*F4)+0.00804*SIN(2*G4)+0.00454*SIN(F4-E4)+0.00204*SIN(2*E4)-0.0018*SIN(F4-2*G4)+D4-0.00306","v":2460697.3540058518}]
[{"$f":"A1+0.08","v":2025.08},0,310,2460704.5802069101,157.51969959566182,2090.9884681723374,2116.5357677472703,{"$f":"-0.4072*SIN(F5)+0.17241*SIN(E5)+0.01608*SIN(2*F5)+0.01039*SIN(2*G5)+0.00739*SIN(F5-E5)-0.00514*SIN(F5+E5)+0.00208*SIN(2*E5)-0.00111*SIN(F5-2*G5)+D5","v":2460705.0269944561}]
[{"$f":"A5","v":2025.08},0.25,310.25,2460711.9628541251,157.64669567175739,2092.6719121299848,2118.2403893885148,{"$f":"-0.62801*SIN(F6)+0.17172*SIN(E6)-0.01183*SIN(F6+E6)+0.00862*SIN(2*F6)+0.00804*SIN(2*G6)+0.00454*SIN(F6-E6)+0.00204*SIN(2*E6)-0.0018*SIN(F6-2*G6)+D6+0.00306","v":2460711.8373392806}]
[{"$f":"A6","v":2025.08},0.5,310.5,2460719.3455013405,157.77369174785298,2094.3553560876321,2119.9450110297598,{"$f":"-0.40614*SIN(F7)+0.17302*SIN(E7)+0.01614*SIN(2*F7)+0.01043*SIN(2*G7)+0.00734*SIN(F7-E7)-0.00515*SIN(F7+E7)+0.00209*SIN(2*E7)-0.00111*SIN(F7-2*G7)+D7","v":2460719.080886791}]
[{"$f":"A7","v":2025.08},0.75,310.75,2460726.7281485558,157.9006878239486,2096.0388000452799,2121.6496326710048,{"$f":"-0.62801*SIN(F8)+0.17172*SIN(E8)-0.01183*SIN(F8+E8)+0.00862*SIN(2*F8)+0.00804*SIN(2*G8)+0.00454*SIN(F8-E8)+0.00204*SIN(2*E8)-0.0018*SIN(F8-2*G8)+D8-0.00306","v":2460727.2312311362}]
[{"$f":"A5+0.08","v":2025.1599999999999},0,311,2460734.1107957708,158.0276839000442,2097.7222440029273,2123.3542543122499,{"$f":"-0.4072*SIN(F9)+0.17241*SIN(E9)+0.01608*SIN(2*F9)+0.01039*SIN(2*G9)+0.00739*SIN(F9-E9)-0.00514*SIN(F9+E9)+0.00208*SIN(2*E9)-0.00111*SIN(F9-2*G9)+D9","v":2460734.5315893251}]
[{"$f":"A9","v":2025.1599999999999},0.25,311.25,2460741.4934429862,158.15467997613979,2099.4056879605751,2125.0588759534949,{"$f":"-0.62801*SIN(F10)+0.17172*SIN(E10)-0.01183*SIN(F10+E10)+0.00862*SIN(2*F10)+0.00804*SIN(2*G10)+0.00454*SIN(F10-E10)+0.00204*SIN(2*E10)-0.0018*SIN(F10-2*G10)+D10+0.00306","v":2460741.1908471449}]
[{"$f":"A10","v":2025.1599999999999},0.5,311.5,2460748.8760902015,158.28167605223541,2101.0891319182224,2126.7634975947399,{"$f":"-0.40614*SIN(F11)+0.17302*SIN(E11)+0.01614*SIN(2*F11)+0.01043*SIN(2*G11)+0.00734*SIN(F11-E11)-0.00515*SIN(F11+E11)+0.00209*SIN(2*E11)-0.00111*SIN(F11-2*G11)+D11","v":2460748.7894963711}]
[{"$f":"A11","v":2025.1599999999999},0.75,311.75,2460756.2587374169,158.40867212833098,2102.7725758758697,2128.4681192359844,{"$f":"-0.62801*SIN(F12)+0.17172*SIN(E12)-0.01183*SIN(F12+E12)+0.00862*SIN(2*F12)+0.00804*SIN(2*G12)+0.00454*SIN(F12-E12)+0.00204*SIN(2*E12)-0.0018*SIN(F12-2*G12)+D12-0.00306","v":2460756.9820051938}]
[{"$f":"A9+0.08","v":2025.2399999999998},0,312,2460763.6413846319,158.53566820442657,2104.4560198335171,2130.1727408772294,{"$f":"-0.4072*SIN(F13)+0.17241*SIN(E13)+0.01608*SIN(2*F13)+0.01039*SIN(2*G13)+0.00739*SIN(F13-E13)-0.00514*SIN(F13+E13)+0.00208*SIN(2*E13)-0.00111*SIN(F13-2*G13)+D13","v":2460763.9568332187}]
[{"$f":"A13","v":2025.2399999999998},0.25,312.25,2460771.0240318472,158.66266428052216,2106.1394637911644,2131.8773625184745,{"$f":"-0.62801*SIN(F14)+0.17172*SIN(E14)-0.01183*SIN(F14+E14)+0.00862*SIN(2*F14)+0.00804*SIN(2*G14)+0.00454*SIN(F14-E14)+0.00204*SIN(2*E14)-0.0018*SIN(F14-2*G14)+D14+0.00306","v":2460770.5950845308}]
[{"$f":"A14","v":2025.2399999999998},0.5,312.5,2460778.4066790626,158.78966035661779,2107.8229077488118,2133.5819841597195,{"$f":"-0.40614*SIN(F15)+0.17302*SIN(E15)+0.01614*SIN(2*F15)+0.01043*SIN(2*G15)+0.00734*SIN(F15-E15)-0.00515*SIN(F15+E15)+0.00209*SIN(2*E15)-0.00111*SIN(F15-2*G15)+D15","v":2460778.5157528436}]
[{"$f":"A15","v":2025.2399999999998},0.75,312.75,2460785.7893262776,158.91665643271338,2109.5063517064596,2135.2866058009645,{"$f":"-0.62801*SIN(F16)+0.17172*SIN(E16)-0.01183*SIN(F16+E16)+0.00862*SIN(2*F16)+0.00804*SIN(2*G16)+0.00454*SIN(F16-E16)+0.00204*SIN(2*E16)-0.0018*SIN(F16-2*G16)+D16-0.00306","v":2460786.5697800564}]
[{"$f":"A13+0.08","v":2025.3199999999997},0,313,2460793.171973493,159.04365250880898,2111.1897956641069,2136.9912274422095,{"$f":"-0.4072*SIN(F17)+0.17241*SIN(E17)+0.01608*SIN(2*F17)+0.01039*SIN(2*G17)+0.00739*SIN(F17-E17)-0.00514*SIN(F17+E17)+0.00208*SIN(2*E17)-0.00111*SIN(F17-2*G17)+D17","v":2460793.3146861917}]
[{"$f":"A17","v":2025.3199999999997},0.25,313.25,2460800.5546207083,159.17064858490457,2112.8732396217547,2138.6958490834545,{"$f":"-0.62801*SIN(F18)+0.17172*SIN(E18)-0.01183*SIN(F18+E18)+0.00862*SIN(2*F18)+0.00804*SIN(2*G18)+0.00454*SIN(F18-E18)+0.00204*SIN(2*E18)-0.0018*SIN(F18-2*G18)+D18+0.00306","v":2460800.0794053809}]
[{"$f":"A18","v":2025.3199999999997},0.5,313.5,2460807.9372679233,159.29764466100016,2114.556683579402,2140.4004707246995,{"$f":"-0.40614*SIN(F19)+0.17302*SIN(E19)+0.01614*SIN(2*F19)+0.01043*SIN(2*G19)+0.00734*SIN(F19-E19)-0.00515*SIN(F19+E19)+0.00209*SIN(2*E19)-0.00111*SIN(F19-2*G19)+D19","v":2460808.2062875885}]
[{"$f":"A19","v":2025.3199999999997},0.75,313.75,2460815.3199151387,159.42464073709579,2116.2401275370494,2142.1050923659445,{"$f":"-0.62801*SIN(F20)+0.17172*SIN(E20)-0.01183*SIN(F20+E20)+0.00862*SIN(2*F20)+0.00804*SIN(2*G20)+0.00454*SIN(F20-E20)+0.00204*SIN(2*E20)-0.0018*SIN(F20-2*G20)+D20-0.00306","v":2460816.0005036695}]
[{"$f":"A17+0.08","v":2025.3999999999996},0,314,2460822.702562354,159.55163681319135,2117.9235714946967,2143.8097140071895,{"$f":"-0.4072*SIN(F21)+0.17241*SIN(E21)+0.01608*SIN(2*F21)+0.01039*SIN(2*G21)+0.00739*SIN(F21-E21)-0.00514*SIN(F21+E21)+0.00208*SIN(2*E21)-0.00111*SIN(F21-2*G21)+D21","v":2460822.6288643442}]
[{"$f":"A21","v":2025.3999999999996},0.25,314.25,2460830.0852095694,159.67863288928694,2119.6070154523441,2145.5143356484341,{"$f":"-0.62801*SIN(F22)+0.17172*SIN(E22)-0.01183*SIN(F22+E22)+0.00862*SIN(2*F22)+0.00804*SIN(2*G22)+0.00454*SIN(F22-E22)+0.00204*SIN(2*E22)-0.0018*SIN(F22-2*G22)+D22+0.00306","v":2460829.6556615578}]
[{"$f":"A22","v":2025.3999999999996},0.5,314.5,2460837.4678567844,159.80562896538257,2121.2904594099914,2147.2189572896791,{"$f":"-0.40614*SIN(F23)+0.17302*SIN(E23)+0.01614*SIN(2*F23)+0.01043*SIN(2*G23)+0.00734*SIN(F23-E23)-0.00515*SIN(F23+E23)+0.00209*SIN(2*E23)-0.00111*SIN(F23-2*G23)+D23","v":2460837.8240887122}]
[{"$f":"A23","v":2025.3999999999996},0.75,314.75,2460844.8505039997,159.93262504147816,2122.9739033676392,2148.9235789309241,{"$f":"-0.62801*SIN(F24)+0.17172*SIN(E24)-0.01183*SIN(F24+E24)+0.00862*SIN(2*F24)+0.00804*SIN(2*G24)+0.00454*SIN(F24-E24)+0.00204*SIN(2*E24)-0.0018*SIN(F24-2*G24)+D24-0.00306","v":2460845.3057702989}]
[{"$f":"A21+0.08","v":2025.4799999999996},0,315,2460852.2331512151,160.05962111757376,2124.6573473252865,2150.6282005721691,{"$f":"-0.4072*SIN(F25)+0.17241*SIN(E25)+0.01608*SIN(2*F25)+0.01039*SIN(2*G25)+0.00739*SIN(F25-E25)-0.00514*SIN(F25+E25)+0.00208*SIN(2*E25)-0.00111*SIN(F25-2*G25)+D25","v":2460851.9399077864}]
[{"$f":"A25","v":2025.4799999999996},0.25,315.25,2460859.6157984301,160.18661719366932,2126.3407912829343,2152.3328222134141,{"$f":"-0.62801*SIN(F26)+0.17172*SIN(E26)-0.01183*SIN(F26+E26)+0.00862*SIN(2*F26)+0.00804*SIN(2*G26)+0.00454*SIN(F26-E26)+0.00204*SIN(2*E26)-0.0018*SIN(F26-2*G26)+D26+0.00306","v":2460859.3140971311}]
[{"$f":"A26","v":2025.4799999999996},0.5,315.5,2460866.9984456454,160.31361326976497,2128.0242352405817,2154.0374438546592,{"$f":"-0.40614*SIN(F27)+0.17302*SIN(E27)+0.01614*SIN(2*F27)+0.01043*SIN(2*G27)+0.00734*SIN(F27-E27)-0.00515*SIN(F27+E27)+0.00209*SIN(2*E27)-0.00111*SIN(F27-2*G27)+D27","v":2460867.3606929388}]
[{"$f":"A27","v":2025.4799999999996},0.75,315.75,2460874.3810928608,160.44060934586054,2129.707679198229,2155.7420654959037,{"$f":"-0.62801*SIN(F28)+0.17172*SIN(E28)-0.01183*SIN(F28+E28)+0.00862*SIN(2*F28)+0.00804*SIN(2*G28)+0.00454*SIN(F28-E28)+0.00204*SIN(2*E28)-0.0018*SIN(F28-2*G28)+D28-0.00306","v":2460874.5283486308}]
[{"$f":"A25+0.08","v":2025.5599999999995},0,316,2460881.7637400758,160.56760542195613,2131.3911231558768,2157.4466871371487,{"$f":"-0.4072*SIN(F29)+0.17241*SIN(E29)+0.01608*SIN(2*F29)+0.01039*SIN(2*G29)+0.00739*SIN(F29-E29)-0.00514*SIN(F29+E29)+0.00208*SIN(2*E29)-0.00111*SIN(F29-2*G29)+D29","v":2460881.2997454605}]
[{"$f":"A29","v":2025.5599999999995},0.25,316.25,2460889.1463872911,160.69460149805175,2133.0745671135242,2159.1513087783942,{"$f":"-0.62801*SIN(F30)+0.17172*SIN(E30)-0.01183*SIN(F30+E30)+0.00862*SIN(2*F30)+0.00804*SIN(2*G30)+0.00454*SIN(F30-E30)+0.00204*SIN(2*E30)-0.0018*SIN(F30-2*G30)+D30+0.00306","v":2460889.028868062}]
[{"$f":"A30","v":2025.5599999999995},0.5,316.5,2460896.5290345065,160.82159757414735,2134.7580110711715,2160.8559304196388,{"$f":"-0.40614*SIN(F31)+0.17302*SIN(E31)+0.01614*SIN(2*F31)+0.01043*SIN(2*G31)+0.00734*SIN(F31-E31)-0.00515*SIN(F31+E31)+0.00209*SIN(2*E31)-0.00111*SIN(F31-2*G31)+D31","v":2460896.8306526165}]
[{"$f":"A31","v":2025.5599999999995},0.75,316.75,2460903.9116817219,160.94859365024294,2136.4414550288188,2162.5605520608838,{"$f":"-0.62801*SIN(F32)+0.17172*SIN(E32)-0.01183*SIN(F32+E32)+0.00862*SIN(2*F32)+0.00804*SIN(2*G32)+0.00454*SIN(F32-E32)+0.00204*SIN(2*E32)-0.0018*SIN(F32-2*G32)+D32-0.00306","v":2460903.7192466352}]
[{"$f":"A29+0.08","v":2025.6399999999994},0,317,2460911.2943289368,161.07558972633854,2138.1248989864662,2164.2651737021288,{"$f":"-0.4072*SIN(F33)+0.17241*SIN(E33)+0.01608*SIN(2*F33)+0.01039*SIN(2*G33)+0.00739*SIN(F33-E33)-0.00514*SIN(F33+E33)+0.00208*SIN(2*E33)-0.00111*SIN(F33-2*G33)+D33","v":2460910.7553262953}]
[{"$f":"A33","v":2025.6399999999994},0.25,317.25,2460918.6769761522,161.20258580243416,2139.808342944114,2165.9697953433738,{"$f":"-0.62801*SIN(F34)+0.17172*SIN(E34)-0.01183*SIN(F34+E34)+0.00862*SIN(2*F34)+0.00804*SIN(2*G34)+0.00454*SIN(F34-E34)+0.00204*SIN(2*E34)-0.0018*SIN(F34-2*G34)+D34+0.00306","v":2460918.7674967693}]
[{"$f":"A34","v":2025.6399999999994},0.5,317.5,2460926.0596233676,161.32958187852975,2141.4917869017613,2167.6744169846188,{"$f":"-0.40614*SIN(F35)+0.17302*SIN(E35)+0.01614*SIN(2*F35)+0.01043*SIN(2*G35)+0.00734*SIN(F35-E35)-0.00515*SIN(F35+E35)+0.00209*SIN(2*E35)-0.00111*SIN(F35-2*G35)+D35","v":2460926.2566689798}]
[{"$f":"A35","v":2025.6399999999994},0.75,317.75,2460933.4422705825,161.45657795462532,2143.1752308594087,2169.3790386258638,{"$f":"-0.62801*SIN(F36)+0.17172*SIN(E36)-0.01183*SIN(F36+E36)+0.00862*SIN(2*F36)+0.00804*SIN(2*G36)+0.00454*SIN(F36-E36)+0.00204*SIN(2*E36)-0.0018*SIN(F36-2*G36)+D36-0.00306","v":2460932.9401387684}]
[{"$f":"A33+0.08","v":2025.7199999999993},0,318,2460940.8249177979,161.58357403072091,2144.8586748170565,2171.0836602671088,{"$f":"-0.4072*SIN(F37)+0.17241*SIN(E37)+0.01608*SIN(2*F37)+0.01039*SIN(2*G37)+0.00739*SIN(F37-E37)-0.00514*SIN(F37+E37)+0.00208*SIN(2*E37)-0.00111*SIN(F37-2*G37)+D37","v":2460940.3307789597}]
[{"$f":"A37","v":2025.7199999999993},0.25,318.25,2460948.2075650133,161.71057010681653,2146.5421187747038,2172.7882819083534,{"$f":"-0.62801*SIN(F38)+0.17172*SIN(E38)-0.01183*SIN(F38+E38)+0.00862*SIN(2*F38)+0.00804*SIN(2*G38)+0.00454*SIN(F38-E38)+0.00204*SIN(2*E38)-0.0018*SIN(F38-2*G38)+D38+0.00306","v":2460948.4965995224}]
[{"$f":"A38","v":2025.7199999999993},0.5,318.5,2460955.5902122282,161.83756618291213,2148.2255627323516,2174.4929035495984,{"$f":"-0.40614*SIN(F39)+0.17302*SIN(E39)+0.01614*SIN(2*F39)+0.01043*SIN(2*G39)+0.00734*SIN(F39-E39)-0.00515*SIN(F39+E39)+0.00209*SIN(2*E39)-0.00111*SIN(F39-2*G39)+D39","v":2460955.6591889434}]
[{"$f":"A39","v":2025.7199999999993},0.75,318.75,2460962.9728594436,161.96456225900772,2149.9090066899989,2176.1975251908439,{"$f":"-0.62801*SIN(F40)+0.17172*SIN(E40)-0.01183*SIN(F40+E40)+0.00862*SIN(2*F40)+0.00804*SIN(2*G40)+0.00454*SIN(F40-E40)+0.00204*SIN(2*E40)-0.0018*SIN(F40-2*G40)+D40-0.00306","v":2460962.2582244831}]
[{"$f":"A37+0.08","v":2025.7999999999993},0,319,2460970.355506659,162.09155833510329,2151.5924506476463,2177.9021468320884,{"$f":"-0.4072*SIN(F41)+0.17241*SIN(E41)+0.01608*SIN(2*F41)+0.01039*SIN(2*G41)+0.00739*SIN(F41-E41)-0.00514*SIN(F41+E41)+0.00208*SIN(2*E41)-0.00111*SIN(F41-2*G41)+D41","v":2460970.0186678409}]
[{"$f":"A41","v":2025.7999999999993},0.25,319.25,2460977.7381538744,162.21855441119894,2153.2758946052936,2179.6067684733334,{"$f":"-0.62801*SIN(F42)+0.17172*SIN(E42)-0.01183*SIN(F42+E42)+0.00862*SIN(2*F42)+0.00804*SIN(2*G42)+0.00454*SIN(F42-E42)+0.00204*SIN(2*E42)-0.0018*SIN(F42-2*G42)+D42+0.00306","v":2460978.1823631134}]
[{"$f":"A42","v":2025.7999999999993},0.5,319.5,2460985.1208010893,162.3455504872945,2154.959338562941,2181.3113901145784,{"$f":"-0.40614*SIN(F43)+0.17302*SIN(E43)+0.01614*SIN(2*F43)+0.01043*SIN(2*G43)+0.00734*SIN(F43-E43)-0.00515*SIN(F43+E43)+0.00209*SIN(2*E43)-0.00111*SIN(F43-2*G43)+D43","v":2460985.0564331659}]
[{"$f":"A43","v":2025.7999999999993},0.75,319.75,2460992.5034483047,162.47254656339013,2156.6427825205888,2183.0160117558235,{"$f":"-0.62801*SIN(F44)+0.17172*SIN(E44)-0.01183*SIN(F44+E44)+0.00862*SIN(2*F44)+0.00804*SIN(2*G44)+0.00454*SIN(F44-E44)+0.00204*SIN(2*E44)-0.0018*SIN(F44-2*G44)+D44-0.00306","v":2460991.7282839692}]
[{"$f":"A41+0.08","v":2025.8799999999992},0,320,2460999.8860955201,162.59954263948572,2158.3262264782361,2184.7206333970685,{"$f":"-0.4072*SIN(F45)+0.17241*SIN(E45)+0.01608*SIN(2*F45)+0.01039*SIN(2*G45)+0.00739*SIN(F45-E45)-0.00514*SIN(F45+E45)+0.00208*SIN(2*E45)-0.00111*SIN(F45-2*G45)+D45","v":2460999.7834775532}]
[{"$f":"A45","v":2025.8799999999992},0.25,320.25,2461007.268742735,162.72653871558134,2160.0096704358834,2186.4252550383135,{"$f":"-0.62801*SIN(F46)+0.17172*SIN(E46)-0.01183*SIN(F46+E46)+0.00862*SIN(2*F46)+0.00804*SIN(2*G46)+0.00454*SIN(F46-E46)+0.00204*SIN(2*E46)-0.0018*SIN(F46-2*G46)+D46+0.00306","v":2461007.7916037119}]
[{"$f":"A46","v":2025.8799999999992},0.5,320.5,2461014.6513899504,162.85353479167691,2161.6931143935312,2188.1298766795585,{"$f":"-0.40614*SIN(F47)+0.17302*SIN(E47)+0.01614*SIN(2*F47)+0.01043*SIN(2*G47)+0.00734*SIN(F47-E47)-0.00515*SIN(F47+E47)+0.00209*SIN(2*E47)-0.00111*SIN(F47-2*G47)+D47","v":2461014.468984711}]
[{"$f":"A47","v":2025.8799999999992},0.75,320.75,2461022.0340371658,162.9805308677725,2163.3765583511786,2189.834498320803,{"$f":"-0.62801*SIN(F48)+0.17172*SIN(E48)-0.01183*SIN(F48+E48)+0.00862*SIN(2*F48)+0.00804*SIN(2*G48)+0.00454*SIN(F48-E48)+0.00204*SIN(2*E48)-0.0018*SIN(F48-2*G48)+D48-0.00306","v":2461021.3705169735}]
[{"$f":"A45+0.08","v":2025.9599999999991},0,321,2461029.4166843812,163.10752694386812,2165.0600023088264,2191.5391199620481,{"$f":"-0.4072*SIN(F49)+0.17241*SIN(E49)+0.01608*SIN(2*F49)+0.01039*SIN(2*G49)+0.00739*SIN(F49-E49)-0.00514*SIN(F49+E49)+0.00208*SIN(2*E49)-0.00111*SIN(F49-2*G49)+D49","v":2461029.5726300906}]
[{"$f":"A49","v":2025.9599999999991},0.25,321.25,2461036.7993315961,163.23452301996372,2166.7434462664737,2193.2437416032935,{"$f":"-0.62801*SIN(F50)+0.17172*SIN(E50)-0.01183*SIN(F50+E50)+0.00862*SIN(2*F50)+0.00804*SIN(2*G50)+0.00454*SIN(F50-E50)+0.00204*SIN(2*E50)-0.0018*SIN(F50-2*G50)+D50+0.00306","v":2461037.2993812971}]
[{"$f":"A50","v":2025.9599999999991},0.5,321.5,2461044.1819788115,163.36151909605931,2168.4268902241211,2194.9483632445381,{"$f":"-0.40614*SIN(F51)+0.17302*SIN(E51)+0.01614*SIN(2*F51)+0.01043*SIN(2*G51)+0.00734*SIN(F51-E51)-0.00515*SIN(F51+E51)+0.00209*SIN(2*E51)-0.00111*SIN(F51-2*G51)+D51","v":2461043.9193761051}]
[{"$f":"A51","v":2025.9599999999991},0.75,321.75,2461051.5646260269,163.48851517215488,2170.1103341817684,2196.6529848857831,{"$f":"-0.62801*SIN(F52)+0.17172*SIN(E52)-0.01183*SIN(F52+E52)+0.00862*SIN(2*F52)+0.00804*SIN(2*G52)+0.00454*SIN(F52-E52)+0.00204*SIN(2*E52)-0.0018*SIN(F52-2*G52)+D52-0.00306","v":2461051.1591473068}]
[{"$f":"A49+0.08","v":2026.0399999999991},0,322,2461058.9472732418,163.6155112482505,2171.7937781394157,2198.3576065270281,{"$f":"-0.4072*SIN(F53)+0.17241*SIN(E53)+0.01608*SIN(2*F53)+0.01039*SIN(2*G53)+0.00739*SIN(F53-E53)-0.00514*SIN(F53+E53)+0.00208*SIN(2*E53)-0.00111*SIN(F53-2*G53)+D53","v":2461059.3289160072}]
[{"$f":"A53","v":2026.0399999999991},0.25,322.25,2461066.3299204572,163.74250732434609,2173.4772220970631,2200.0622281682731,{"$f":"-0.62801*SIN(F54)+0.17172*SIN(E54)-0.01183*SIN(F54+E54)+0.00862*SIN(2*F54)+0.00804*SIN(2*G54)+0.00454*SIN(F54-E54)+0.00204*SIN(2*E54)-0.0018*SIN(F54-2*G54)+D54+0.00306","v":2461066.7013119524}]
[{"$f":"A54","v":2026.0399999999991},0.5,322.5,2461073.7125676726,163.86950340044169,2175.1606660547109,2201.7668498095181,{"$f":"-0.40614*SIN(F55)+0.17302*SIN(E55)+0.01614*SIN(2*F55)+0.01043*SIN(2*G55)+0.00734*SIN(F55-E55)-0.00515*SIN(F55+E55)+0.00209*SIN(2*E55)-0.00111*SIN(F55-2*G55)+D55","v":2461073.4242831636}]
[{"$f":"A55","v":2026.0399999999991},0.75,322.75,2461081.0952148875,163.99649947653728,2176.8441100123582,2203.4714714507631,{"$f":"-0.62801*SIN(F56)+0.17172*SIN(E56)-0.01183*SIN(F56+E56)+0.00862*SIN(2*F56)+0.00804*SIN(2*G56)+0.00454*SIN(F56-E56)+0.00204*SIN(2*E56)-0.0018*SIN(F56-2*G56)+D56-0.00306","v":2461081.0300866887}]