{"text_format":"1","workbook":"xlsx","n_sheets":11,"sheets":["Verzeichnis","Allte Rezepte als Link","Wie geht's","Notizen","Daten","Vorlage","Butterzöpfe","GP's Kokosmakronen","Wienerli im Teig","Pinos Focaccia","Rhabarberwähe"],"not_rendered":{"charts":0,"images":18,"macros":1,"external_links":1,"defined_names":27,"comments":0,"pivot_tables":0},"unopened":[],"bounds":{"document_bytes":16777216,"sheet_cells":100000,"rows_first":2000,"rows_last":500,"rows_between":2000,"halvings":0,"cell_chars":16384,"cell_head_chars":4096},"cells_cut":0,"cells_raw":0,"read":"whole","date_system":"1900"}

{"sheet":"Verzeichnis","index":0,"n_rows":0,"n_cols":0,"rows_kept":0,"cut":false,"hidden":false,"merged":[]}

{"sheet":"Allte Rezepte als Link","index":1,"n_rows":491,"n_cols":2,"rows_kept":491,"cut":false,"hidden":false,"merged":[]}
[]
[]
[]
[]
[null,{"$f":"IF(ROW(A1)>COUNTA(x),\"\",HYPERLINK(\"#'\"&INDEX(x,ROW(A1))&\"'!A1\",MID(INDEX(x,ROW(A1)),FIND(\"]\",INDEX(x,ROW(A1)))+1,31)))","v":"Verzeichnis"}]
[null,{"$f":"IF(ROW(A2)>COUNTA(x),\"\",HYPERLINK(\"#'\"&INDEX(x,ROW(A2))&\"'!A1\",MID(INDEX(x,ROW(A2)),FIND(\"]\",INDEX(x,ROW(A2)))+1,31)))","v":"Allte Rezepte als Link"}]
[null,{"$f":"IF(ROW(A3)>COUNTA(x),\"\",HYPERLINK(\"#'\"&INDEX(x,ROW(A3))&\"'!A1\",MID(INDEX(x,ROW(A3)),FIND(\"]\",INDEX(x,ROW(A3)))+1,31)))","v":"Wie geht's"}]
[null,{"$f":"IF(ROW(A4)>COUNTA(x),\"\",HYPERLINK(\"#'\"&INDEX(x,ROW(A4))&\"'!A1\",MID(INDEX(x,ROW(A4)),FIND(\"]\",INDEX(x,ROW(A4)))+1,31)))","v":"Notizen"}]
[null,{"$f":"IF(ROW(A5)>COUNTA(x),\"\",HYPERLINK(\"#'\"&INDEX(x,ROW(A5))&\"'!A1\",MID(INDEX(x,ROW(A5)),FIND(\"]\",INDEX(x,ROW(A5)))+1,31)))","v":"Daten"}]
[null,{"$f":"IF(ROW(A6)>COUNTA(x),\"\",HYPERLINK(\"#'\"&INDEX(x,ROW(A6))&\"'!A1\",MID(INDEX(x,ROW(A6)),FIND(\"]\",INDEX(x,ROW(A6)))+1,31)))","v":"Vorlage"}]
[null,{"$f":"IF(ROW(A7)>COUNTA(x),\"\",HYPERLINK(\"#'\"&INDEX(x,ROW(A7))&\"'!A1\",MID(INDEX(x,ROW(A7)),FIND(\"]\",INDEX(x,ROW(A7)))+1,31)))","v":"Butterzöpfe"}]
[null,{"$f":"IF(ROW(A8)>COUNTA(x),\"\",HYPERLINK(\"#'\"&INDEX(x,ROW(A8))&\"'!A1\",MID(INDEX(x,ROW(A8)),FIND(\"]\",INDEX(x,ROW(A8)))+1,31)))","v":"GP's Kokosmakronen"}]
[null,{"$f":"IF(ROW(A9)>COUNTA(x),\"\",HYPERLINK(\"#'\"&INDEX(x,ROW(A9))&\"'!A1\",MID(INDEX(x,ROW(A9)),FIND(\"]\",INDEX(x,ROW(A9)))+1,31)))","v":"Wienerli im Teig"}]
[null,{"$f":"IF(ROW(A10)>COUNTA(x),\"\",HYPERLINK(\"#'\"&INDEX(x,ROW(A10))&\"'!A1\",MID(INDEX(x,ROW(A10)),FIND(\"]\",INDEX(x,ROW(A10)))+1,31)))","v":"Pinos Focaccia"}]
[null,{"$f":"IF(ROW(A11)>COUNTA(x),\"\",HYPERLINK(\"#'\"&INDEX(x,ROW(A11))&\"'!A1\",MID(INDEX(x,ROW(A11)),FIND(\"]\",INDEX(x,ROW(A11)))+1,31)))","v":"Rhabarberwähe"}]
[null,{"$f":"IF(ROW(A12)>COUNTA(x),\"\",HYPERLINK(\"#'\"&INDEX(x,ROW(A12))&\"'!A1\",MID(INDEX(x,ROW(A12)),FIND(\"]\",INDEX(x,ROW(A12)))+1,31)))","v":""}]
[null,{"$f":"IF(ROW(A13)>COUNTA(x),\"\",HYPERLINK(\"#'\"&INDEX(x,ROW(A13))&\"'!A1\",MID(INDEX(x,ROW(A13)),FIND(\"]\",INDEX(x,ROW(A13)))+1,31)))","v":""}]
[null,{"$f":"IF(ROW(A14)>COUNTA(x),\"\",HYPERLINK(\"#'\"&INDEX(x,ROW(A14))&\"'!A1\",MID(INDEX(x,ROW(A14)),FIND(\"]\",INDEX(x,ROW(A14)))+1,31)))","v":""}]
[null,{"$f":"IF(ROW(A15)>COUNTA(x),\"\",HYPERLINK(\"#'\"&INDEX(x,ROW(A15))&\"'!A1\",MID(INDEX(x,ROW(A15)),FIND(\"]\",INDEX(x,ROW(A15)))+1,31)))","v":""}]
[null,{"$f":"IF(ROW(A16)>COUNTA(x),\"\",HYPERLINK(\"#'\"&INDEX(x,ROW(A16))&\"'!A1\",MID(INDEX(x,ROW(A16)),FIND(\"]\",INDEX(x,ROW(A16)))+1,31)))","v":""}]
[null,{"$f":"IF(ROW(A17)>COUNTA(x),\"\",HYPERLINK(\"#'\"&INDEX(x,ROW(A17))&\"'!A1\",MID(INDEX(x,ROW(A17)),FIND(\"]\",INDEX(x,ROW(A17)))+1,31)))","v":""}]
[null,{"$f":"IF(ROW(A18)>COUNTA(x),\"\",HYPERLINK(\"#'\"&INDEX(x,ROW(A18))&\"'!A1\",MID(INDEX(x,ROW(A18)),FIND(\"]\",INDEX(x,ROW(A18)))+1,31)))","v":""}]
[null,{"$f":"IF(ROW(A19)>COUNTA(x),\"\",HYPERLINK(\"#'\"&INDEX(x,ROW(A19))&\"'!A1\",MID(INDEX(x,ROW(A19)),FIND(\"]\",INDEX(x,ROW(A19)))+1,31)))","v":""}]
[null,{"$f":"IF(ROW(A20)>COUNTA(x),\"\",HYPERLINK(\"#'\"&INDEX(x,ROW(A20))&\"'!A1\",MID(INDEX(x,ROW(A20)),FIND(\"]\",INDEX(x,ROW(A20)))+1,31)))","v":""}]
[null,{"$f":"IF(ROW(A21)>COUNTA(x),\"\",HYPERLINK(\"#'\"&INDEX(x,ROW(A21))&\"'!A1\",MID(INDEX(x,ROW(A21)),FIND(\"]\",INDEX(x,ROW(A21)))+1,31)))","v":""}]
[null,{"$f":"IF(ROW(A22)>COUNTA(x),\"\",HYPERLINK(\"#'\"&INDEX(x,ROW(A22))&\"'!A1\",MID(INDEX(x,ROW(A22)),FIND(\"]\",INDEX(x,ROW(A22)))+1,31)))","v":""}]
[null,{"$f":"IF(ROW(A23)>COUNTA(x),\"\",HYPERLINK(\"#'\"&INDEX(x,ROW(A23))&\"'!A1\",MID(INDEX(x,ROW(A23)),FIND(\"]\",INDEX(x,ROW(A23)))+1,31)))","v":""}]
[null,{"$f":"IF(ROW(A24)>COUNTA(x),\"\",HYPERLINK(\"#'\"&INDEX(x,ROW(A24))&\"'!A1\",MID(INDEX(x,ROW(A24)),FIND(\"]\",INDEX(x,ROW(A24)))+1,31)))","v":""}]
[null,{"$f":"IF(ROW(A25)>COUNTA(x),\"\",HYPERLINK(\"#'\"&INDEX(x,ROW(A25))&\"'!A1\",MID(INDEX(x,ROW(A25)),FIND(\"]\",INDEX(x,ROW(A25)))+1,31)))","v":""}]
[null,{"$f":"IF(ROW(A26)>COUNTA(x),\"\",HYPERLINK(\"#'\"&INDEX(x,ROW(A26))&\"'!A1\",MID(INDEX(x,ROW(A26)),FIND(\"]\",INDEX(x,ROW(A26)))+1,31)))","v":""}]
[null,{"$f":"IF(ROW(A27)>COUNTA(x),\"\",HYPERLINK(\"#'\"&INDEX(x,ROW(A27))&\"'!A1\",MID(INDEX(x,ROW(A27)),FIND(\"]\",INDEX(x,ROW(A27)))+1,31)))","v":""}]
[null,{"$f":"IF(ROW(A28)>COUNTA(x),\"\",HYPERLINK(\"#'\"&INDEX(x,ROW(A28))&\"'!A1\",MID(INDEX(x,ROW(A28)),FIND(\"]\",INDEX(x,ROW(A28)))+1,31)))","v":""}]
[null,{"$f":"IF(ROW(A29)>COUNTA(x),\"\",HYPERLINK(\"#'\"&INDEX(x,ROW(A29))&\"'!A1\",MID(INDEX(x,ROW(A29)),FIND(\"]\",INDEX(x,ROW(A29)))+1,31)))","v":""}]
[null,{"$f":"IF(ROW(A30)>COUNTA(x),\"\",HYPERLINK(\"#'\"&INDEX(x,ROW(A30))&\"'!A1\",MID(INDEX(x,ROW(A30)),FIND(\"]\",INDEX(x,ROW(A30)))+1,31)))","v":""}]
[null,{"$f":"IF(ROW(A31)>COUNTA(x),\"\",HYPERLINK(\"#'\"&INDEX(x,ROW(A31))&\"'!A1\",MID(INDEX(x,ROW(A31)),FIND(\"]\",INDEX(x,ROW(A31)))+1,31)))","v":""}]
[null,{"$f":"IF(ROW(A32)>COUNTA(x),\"\",HYPERLINK(\"#'\"&INDEX(x,ROW(A32))&\"'!A1\",MID(INDEX(x,ROW(A32)),FIND(\"]\",INDEX(x,ROW(A32)))+1,31)))","v":""}]
[null,{"$f":"IF(ROW(A33)>COUNTA(x),\"\",HYPERLINK(\"#'\"&INDEX(x,ROW(A33))&\"'!A1\",MID(INDEX(x,ROW(A33)),FIND(\"]\",INDEX(x,ROW(A33)))+1,31)))","v":""}]
[null,{"$f":"IF(ROW(A34)>COUNTA(x),\"\",HYPERLINK(\"#'\"&INDEX(x,ROW(A34))&\"'!A1\",MID(INDEX(x,ROW(A34)),FIND(\"]\",INDEX(x,ROW(A34)))+1,31)))","v":""}]
[null,{"$f":"IF(ROW(A35)>COUNTA(x),\"\",HYPERLINK(\"#'\"&INDEX(x,ROW(A35))&\"'!A1\",MID(INDEX(x,ROW(A35)),FIND(\"]\",INDEX(x,ROW(A35)))+1,31)))","v":""}]
[null,{"$f":"IF(ROW(A36)>COUNTA(x),\"\",HYPERLINK(\"#'\"&INDEX(x,ROW(A36))&\"'!A1\",MID(INDEX(x,ROW(A36)),FIND(\"]\",INDEX(x,ROW(A36)))+1,31)))","v":""}]
[null,{"$f":"IF(ROW(A37)>COUNTA(x),\"\",HYPERLINK(\"#'\"&INDEX(x,ROW(A37))&\"'!A1\",MID(INDEX(x,ROW(A37)),FIND(\"]\",INDEX(x,ROW(A37)))+1,31)))","v":""}]
[null,{"$f":"IF(ROW(A38)>COUNTA(x),\"\",HYPERLINK(\"#'\"&INDEX(x,ROW(A38))&\"'!A1\",MID(INDEX(x,ROW(A38)),FIND(\"]\",INDEX(x,ROW(A38)))+1,31)))","v":""}]
[null,{"$f":"IF(ROW(A39)>COUNTA(x),\"\",HYPERLINK(\"#'\"&INDEX(x,ROW(A39))&\"'!A1\",MID(INDEX(x,ROW(A39)),FIND(\"]\",INDEX(x,ROW(A39)))+1,31)))","v":""}]
[null,{"$f":"IF(ROW(A40)>COUNTA(x),\"\",HYPERLINK(\"#'\"&INDEX(x,ROW(A40))&\"'!A1\",MID(INDEX(x,ROW(A40)),FIND(\"]\",INDEX(x,ROW(A40)))+1,31)))","v":""}]
[null,{"$f":"IF(ROW(A41)>COUNTA(x),\"\",HYPERLINK(\"#'\"&INDEX(x,ROW(A41))&\"'!A1\",MID(INDEX(x,ROW(A41)),FIND(\"]\",INDEX(x,ROW(A41)))+1,31)))","v":""}]
[null,{"$f":"IF(ROW(A42)>COUNTA(x),\"\",HYPERLINK(\"#'\"&INDEX(x,ROW(A42))&\"'!A1\",MID(INDEX(x,ROW(A42)),FIND(\"]\",INDEX(x,ROW(A42)))+1,31)))","v":""}]
[null,{"$f":"IF(ROW(A43)>COUNTA(x),\"\",HYPERLINK(\"#'\"&INDEX(x,ROW(A43))&\"'!A1\",MID(INDEX(x,ROW(A43)),FIND(\"]\",INDEX(x,ROW(A43)))+1,31)))","v":""}]
[null,{"$f":"IF(ROW(A44)>COUNTA(x),\"\",HYPERLINK(\"#'\"&INDEX(x,ROW(A44))&\"'!A1\",MID(INDEX(x,ROW(A44)),FIND(\"]\",INDEX(x,ROW(A44)))+1,31)))","v":""}]
[null,{"$f":"IF(ROW(A45)>COUNTA(x),\"\",HYPERLINK(\"#'\"&INDEX(x,ROW(A45))&\"'!A1\",MID(INDEX(x,ROW(A45)),FIND(\"]\",INDEX(x,ROW(A45)))+1,31)))","v":""}]
[null,{"$f":"IF(ROW(A46)>COUNTA(x),\"\",HYPERLINK(\"#'\"&INDEX(x,ROW(A46))&\"'!A1\",MID(INDEX(x,ROW(A46)),FIND(\"]\",INDEX(x,ROW(A46)))+1,31)))","v":""}]
[null,{"$f":"IF(ROW(A47)>COUNTA(x),\"\",HYPERLINK(\"#'\"&INDEX(x,ROW(A47))&\"'!A1\",MID(INDEX(x,ROW(A47)),FIND(\"]\",INDEX(x,ROW(A47)))+1,31)))","v":""}]
[null,{"$f":"IF(ROW(A48)>COUNTA(x),\"\",HYPERLINK(\"#'\"&INDEX(x,ROW(A48))&\"'!A1\",MID(INDEX(x,ROW(A48)),FIND(\"]\",INDEX(x,ROW(A48)))+1,31)))","v":""}]
[null,{"$f":"IF(ROW(A49)>COUNTA(x),\"\",HYPERLINK(\"#'\"&INDEX(x,ROW(A49))&\"'!A1\",MID(INDEX(x,ROW(A49)),FIND(\"]\",INDEX(x,ROW(A49)))+1,31)))","v":""}]
[null,{"$f":"IF(ROW(A50)>COUNTA(x),\"\",HYPERLINK(\"#'\"&INDEX(x,ROW(A50))&\"'!A1\",MID(INDEX(x,ROW(A50)),FIND(\"]\",INDEX(x,ROW(A50)))+1,31)))","v":""}]
[null,{"$f":"IF(ROW(A51)>COUNTA(x),\"\",HYPERLINK(\"#'\"&INDEX(x,ROW(A51))&\"'!A1\",MID(INDEX(x,ROW(A51)),FIND(\"]\",INDEX(x,ROW(A51)))+1,31)))","v":""}]
[null,{"$f":"IF(ROW(A52)>COUNTA(x),\"\",HYPERLINK(\"#'\"&INDEX(x,ROW(A52))&\"'!A1\",MID(INDEX(x,ROW(A52)),FIND(\"]\",INDEX(x,ROW(A52)))+1,31)))","v":""}]
[null,{"$f":"IF(ROW(A53)>COUNTA(x),\"\",HYPERLINK(\"#'\"&INDEX(x,ROW(A53))&\"'!A1\",MID(INDEX(x,ROW(A53)),FIND(\"]\",INDEX(x,ROW(A53)))+1,31)))","v":""}]
[null,{"$f":"IF(ROW(A54)>COUNTA(x),\"\",HYPERLINK(\"#'\"&INDEX(x,ROW(A54))&\"'!A1\",MID(INDEX(x,ROW(A54)),FIND(\"]\",INDEX(x,ROW(A54)))+1,31)))","v":""}]
[null,{"$f":"IF(ROW(A55)>COUNTA(x),\"\",HYPERLINK(\"#'\"&INDEX(x,ROW(A55))&\"'!A1\",MID(INDEX(x,ROW(A55)),FIND(\"]\",INDEX(x,ROW(A55)))+1,31)))","v":""}]
[null,{"$f":"IF(ROW(A56)>COUNTA(x),\"\",HYPERLINK(\"#'\"&INDEX(x,ROW(A56))&\"'!A1\",MID(INDEX(x,ROW(A56)),FIND(\"]\",INDEX(x,ROW(A56)))+1,31)))","v":""}]
[null,{"$f":"IF(ROW(A57)>COUNTA(x),\"\",HYPERLINK(\"#'\"&INDEX(x,ROW(A57))&\"'!A1\",MID(INDEX(x,ROW(A57)),FIND(\"]\",INDEX(x,ROW(A57)))+1,31)))","v":""}]
[null,{"$f":"IF(ROW(A58)>COUNTA(x),\"\",HYPERLINK(\"#'\"&INDEX(x,ROW(A58))&\"'!A1\",MID(INDEX(x,ROW(A58)),FIND(\"]\",INDEX(x,ROW(A58)))+1,31)))","v":""}]
[null,{"$f":"IF(ROW(A59)>COUNTA(x),\"\",HYPERLINK(\"#'\"&INDEX(x,ROW(A59))&\"'!A1\",MID(INDEX(x,ROW(A59)),FIND(\"]\",INDEX(x,ROW(A59)))+1,31)))","v":""}]
[null,{"$f":"IF(ROW(A60)>COUNTA(x),\"\",HYPERLINK(\"#'\"&INDEX(x,ROW(A60))&\"'!A1\",MID(INDEX(x,ROW(A60)),FIND(\"]\",INDEX(x,ROW(A60)))+1,31)))","v":""}]
[null,{"$f":"IF(ROW(A61)>COUNTA(x),\"\",HYPERLINK(\"#'\"&INDEX(x,ROW(A61))&\"'!A1\",MID(INDEX(x,ROW(A61)),FIND(\"]\",INDEX(x,ROW(A61)))+1,31)))","v":""}]
[null,{"$f":"IF(ROW(A62)>COUNTA(x),\"\",HYPERLINK(\"#'\"&INDEX(x,ROW(A62))&\"'!A1\",MID(INDEX(x,ROW(A62)),FIND(\"]\",INDEX(x,ROW(A62)))+1,31)))","v":""}]
[null,{"$f":"IF(ROW(A63)>COUNTA(x),\"\",HYPERLINK(\"#'\"&INDEX(x,ROW(A63))&\"'!A1\",MID(INDEX(x,ROW(A63)),FIND(\"]\",INDEX(x,ROW(A63)))+1,31)))","v":""}]
[null,{"$f":"IF(ROW(A64)>COUNTA(x),\"\",HYPERLINK(\"#'\"&INDEX(x,ROW(A64))&\"'!A1\",MID(INDEX(x,ROW(A64)),FIND(\"]\",INDEX(x,ROW(A64)))+1,31)))","v":""}]
[null,{"$f":"IF(ROW(A65)>COUNTA(x),\"\",HYPERLINK(\"#'\"&INDEX(x,ROW(A65))&\"'!A1\",MID(INDEX(x,ROW(A65)),FIND(\"]\",INDEX(x,ROW(A65)))+1,31)))","v":""}]
[null,{"$f":"IF(ROW(A66)>COUNTA(x),\"\",HYPERLINK(\"#'\"&INDEX(x,ROW(A66))&\"'!A1\",MID(INDEX(x,ROW(A66)),FIND(\"]\",INDEX(x,ROW(A66)))+1,31)))","v":""}]
[null,{"$f":"IF(ROW(A67)>COUNTA(x),\"\",HYPERLINK(\"#'\"&INDEX(x,ROW(A67))&\"'!A1\",MID(INDEX(x,ROW(A67)),FIND(\"]\",INDEX(x,ROW(A67)))+1,31)))","v":""}]
[null,{"$f":"IF(ROW(A68)>COUNTA(x),\"\",HYPERLINK(\"#'\"&INDEX(x,ROW(A68))&\"'!A1\",MID(INDEX(x,ROW(A68)),FIND(\"]\",INDEX(x,ROW(A68)))+1,31)))","v":""}]
[null,{"$f":"IF(ROW(A69)>COUNTA(x),\"\",HYPERLINK(\"#'\"&INDEX(x,ROW(A69))&\"'!A1\",MID(INDEX(x,ROW(A69)),FIND(\"]\",INDEX(x,ROW(A69)))+1,31)))","v":""}]
[null,{"$f":"IF(ROW(A70)>COUNTA(x),\"\",HYPERLINK(\"#'\"&INDEX(x,ROW(A70))&\"'!A1\",MID(INDEX(x,ROW(A70)),FIND(\"]\",INDEX(x,ROW(A70)))+1,31)))","v":""}]
[null,{"$f":"IF(ROW(A71)>COUNTA(x),\"\",HYPERLINK(\"#'\"&INDEX(x,ROW(A71))&\"'!A1\",MID(INDEX(x,ROW(A71)),FIND(\"]\",INDEX(x,ROW(A71)))+1,31)))","v":""}]
[null,{"$f":"IF(ROW(A72)>COUNTA(x),\"\",HYPERLINK(\"#'\"&INDEX(x,ROW(A72))&\"'!A1\",MID(INDEX(x,ROW(A72)),FIND(\"]\",INDEX(x,ROW(A72)))+1,31)))","v":""}]
[null,{"$f":"IF(ROW(A73)>COUNTA(x),\"\",HYPERLINK(\"#'\"&INDEX(x,ROW(A73))&\"'!A1\",MID(INDEX(x,ROW(A73)),FIND(\"]\",INDEX(x,ROW(A73)))+1,31)))","v":""}]
[null,{"$f":"IF(ROW(A74)>COUNTA(x),\"\",HYPERLINK(\"#'\"&INDEX(x,ROW(A74))&\"'!A1\",MID(INDEX(x,ROW(A74)),FIND(\"]\",INDEX(x,ROW(A74)))+1,31)))","v":""}]
[null,{"$f":"IF(ROW(A75)>COUNTA(x),\"\",HYPERLINK(\"#'\"&INDEX(x,ROW(A75))&\"'!A1\",MID(INDEX(x,ROW(A75)),FIND(\"]\",INDEX(x,ROW(A75)))+1,31)))","v":""}]
[null,{"$f":"IF(ROW(A76)>COUNTA(x),\"\",HYPERLINK(\"#'\"&INDEX(x,ROW(A76))&\"'!A1\",MID(INDEX(x,ROW(A76)),FIND(\"]\",INDEX(x,ROW(A76)))+1,31)))","v":""}]
{"$rows_left_out":412}
{"sheet":"Wie geht's","index":2,"n_rows":211,"n_cols":3,"rows_kept":211,"cut":false,"hidden":false,"merged":[]}
[null,{"$f":"TODAY()","v":"2020-02-05"},{"$f":"RIGHT(CELL(\"dateiname\",A1),LEN(CELL(\"dateiname\",A1))-FIND(\"]\",CELL(\"dateiname\",A1)))&\"  Bedienungsanleitung\"","v":"Wie geht's  Bedienungsanleitung"}]
[]
[null,null,"Hier die Anleitung"]
[]
[]
[]
[]
[]
[]
[]
[]
[]
[]
[]
[]
[]
[]
[]
[]
[]
[]
[]
[]
[]
[]
[]
[]
[]
[]
[]
[]
[]
[]
[]
[]
[]
[]
[]
[]
[]
[]
[]
[]
[]
[]
[]
[]
[]
[]
[]
[]
[]
[]
[]
[]
[]
[]
[]
[]
[]
[]
[]
[]
[]
[]
[]
[]
[]
[]
[]
[]
[]
[]
[]
[]
[]
[]
[]
[]
[]
{"$rows_left_out":132}
{"sheet":"Notizen","index":3,"n_rows":10000,"n_cols":3,"rows_kept":10000,"cut":false,"hidden":false,"merged":[]}
[null,{"$f":"TODAY()","v":"2020-02-05"},{"$f":"RIGHT(CELL(\"dateiname\",A1),LEN(CELL(\"dateiname\",A1))-FIND(\"]\",CELL(\"dateiname\",A1)))&\"  Problem\"","v":"Notizen  Problem"}]
["Pos.","Datum:","Werkzeug:"]
[{"$f":"IF(B3>0,1,\"\")","v":1},"2019-01-29T18:09:32","Vorlage erstellen!"]
[{"$f":"IF(B4>0,A3+1,\"\")","v":""}]
[{"$f":"IF(B5>0,A4+1,\"\")","v":""}]
[""]
[""]
[""]
[""]
[""]
[""]
[""]
[""]
[""]
[""]
[""]
[""]
[""]
[""]
[""]
[""]
[""]
[""]
[""]
[""]
[""]
[""]
[""]
[""]
[""]
[""]
[""]
[""]
[""]
[""]
[""]
[""]
[""]
[""]
[""]
[""]
[""]
[""]
[""]
[""]
[""]
[""]
[""]
[""]
[""]
[""]
[""]
[""]
[""]
[""]
[""]
[""]
[""]
[""]
[""]
[""]
[""]
[""]
[""]
[""]
[""]
[""]
[""]
[{"$f":"IF(B69>0,A68+1,\"\")","v":""}]
[""]
[""]
[""]
[""]
[""]
[""]
[""]
[""]
[""]
[""]
[""]
{"$rows_left_out":9921}
{"sheet":"Daten","index":4,"n_rows":20,"n_cols":1,"rows_kept":20,"cut":false,"hidden":false,"merged":[]}
["Mengenangabe"]
[]
["Esslöffel"]
["Kg."]
["gr."]
["dl."]
["Kaffeelöffel"]
["Glas"]
["Centi Liter"]
["Liter"]
["Mili Liter"]
["prise"]
["Eier"]
["Eiweiss"]
["Eigelb"]
["Zucker"]
["Kokosflocken"]
["Stk."]
["Scheiben"]
["Teelöffel"]

{"sheet":"Vorlage","index":5,"n_rows":67,"n_cols":5,"rows_kept":67,"cut":false,"hidden":false,"merged":[[2,1,2,3],[17,1,17,3],[66,1,66,2],[66,3,66,4],[58,1,58,4],[45,1,45,4],[23,1,23,4],[46,1,56,4],[59,1,64,4]]}
[null,null,null,{"$f":"RIGHT(CELL(\"dateiname\",B1),LEN(CELL(\"dateiname\",B1))-FIND(\"]\",CELL(\"dateiname\",B1)))&\"  Rezept\"","v":"Vorlage  Rezept"}]
[]
[null,"MENUE"]
[]
[]
[]
[]
[]
[]
[]
[]
[]
[]
[]
[]
[]
[]
[null,"Name??"]
[]
[null,"Für\nPersonen",null,"?"]
[]
[]
[]
[null,{"$f":"\"Zutaten für \"&D20&\" \"&B18","v":"Zutaten für ? Name??"}]
[]
[null,"Menge:","Menge:","Was:","Beschreibung:"]
[]
[]
[]
[]
[]
[]
[]
[]
[]
[]
[]
[]
[]
[]
[]
[]
[]
[]
[]
[null,"Beschreiben:"]
[]
[]
[]
[]
[]
[]
[]
[]
[]
[]
[]
[]
[null,"TIPP:"]
[]
[]
[]
[]
[]
[]
[]
[null,{"$f":"TEXT(TODAY(),\"TT.MM.JJ\")&\"  © by mablu\"","v":"05.02.20  © by mablu"},null,{"$f":"CELL(\"Dateiname\",A1)","v":"C:\\Users\\MBDELL\\Documents\\Meine Rezepte\\[REZEPT-MB.xlsm]Vorlage"}]

{"sheet":"Butterzöpfe","index":6,"n_rows":67,"n_cols":5,"rows_kept":67,"cut":false,"hidden":false,"merged":[[59,1,64,4],[66,1,66,2],[66,3,66,4],[2,1,2,3],[17,1,17,3],[23,1,23,4],[45,1,45,4],[46,1,56,4],[58,1,58,4]]}
[null,null,null,{"$f":"RIGHT(CELL(\"dateiname\",B1),LEN(CELL(\"dateiname\",B1))-FIND(\"]\",CELL(\"dateiname\",B1)))&\"  Rezept\"","v":"Butterzöpfe  Rezept"}]
[]
[null,"MENUE"]
[]
[]
[]
[]
[]
[]
[]
[]
[]
[]
[]
[]
[]
[]
[null,"Butterzöpfe"]
[]
[null,"Für\nPersonen"]
[]
[]
[]
[null,{"$f":"\"Zutaten für \"&D20&\" \"&B18","v":"Zutaten für  Butterzöpfe"}]
[]
[null,"Menge:","Menge:","Was:","Beschreibung:"]
[null,"1","Kg.","Mehl","ins Becken geben"]
[null,"1","Esslöffel","Salz","ringsum streuen"]
[null,"5","dl.","Milch","wärmen (lauwarm)"]
[null,"150","gr.","Butter","flüssig machen nicht Heiss (in Mikrowelle wenn vorhanden)"]
[null,"1","prise","Salz","in wenig Milch auflösen zusammen mit der Hefe"]
[null,"40","gr.","Hefe","nicht Heiss werden lassen max. 30°"]
[]
[]
[]
[]
[]
[]
[]
[]
[]
[]
[]
[]
[]
[null,"Beschreiben:"]
[null,"Alle in Teigschüssel miteinander mischen. Den Teig gut kneten er darf aber nicht zu warm werden. Dann den teig zudecken und auf das doppelte Volumen aufgehen lassen, damit es schneller geht etwas warmes Wasser in das Abwaschbecken geben und die Teigschüssel zugedeckt darin warm werden lassen.\nTeig in 4 Stücke trennen und ausrollen in 4 lange Stangen die in der Mitte etwas dicker sind als am Ende, das gibt die schöne Zopfform. Dann werden die Zöpfe zu 2 Zöpfen geformt. Danach lässt man die geformten Zöpfe nochmals ca. 1 Stunde mit einem feuchten Tuch gedeckt aufgehen.\nMit Eigelb bestreichen für eine glänzende Aussenschale.\n\nBacken bei ca. 200° etwa 20 Minuten"]
[]
[]
[]
[]
[]
[]
[]
[]
[]
[]
[]
[null,"TIPP:"]
[null,"Backofenvorheitzen auf 200° ca. 10 Minuten\n\nFür einen Speckzopf, 2 Beutel a 120 gr. Speck anbraten gut abtrocknen und unter die Teigmasse geben vor dem 2. mal aufgehen lassen."]
[]
[]
[]
[]
[]
[]
[null,{"$f":"TEXT(TODAY(),\"TT.MM.JJ\")&\"  © by mablu\"","v":"05.02.20  © by mablu"},null,{"$f":"CELL(\"Dateiname\",A1)","v":"C:\\Users\\MBDELL\\Documents\\Meine Rezepte\\[REZEPT-MB.xlsm]Butterzöpfe"}]

{"sheet":"GP's Kokosmakronen","index":7,"n_rows":67,"n_cols":5,"rows_kept":67,"cut":false,"hidden":false,"merged":[[59,1,64,4],[66,1,66,2],[66,3,66,4],[2,1,2,3],[17,1,17,3],[23,1,23,4],[45,1,45,4],[46,1,56,4],[58,1,58,4]]}
[null,null,null,{"$f":"RIGHT(CELL(\"dateiname\",B1),LEN(CELL(\"dateiname\",B1))-FIND(\"]\",CELL(\"dateiname\",B1)))&\"  Rezept\"","v":"GP's Kokosmakronen  Rezept"}]
[]
[null,"MENUE"]
[]
[]
[]
[]
[]
[]
[]
[]
[]
[]
[]
[]
[]
[]
[null,"GP's Kokosmakronen Guetzli"]
[]
[null,"Für\nPersonen"]
[]
[]
[]
[null,{"$f":"\"Zutaten für \"&D20&\" \"&B18","v":"Zutaten für  GP's Kokosmakronen Guetzli"}]
[]
[null,"Menge:","Menge:","Was:","Beschreibung:"]
[null,"3","Eiweiss","schlagen","Steif schlagen zusammen mit den aufgeführten Zutaten"]
[null,"75","Zucker","einrühren","weiterschlagen und zugeben bis das Luftig glänzend wird"]
[null,"75","Zucker","einrühren","weiterschlagen und zugeben bis das Luftig glänzend wird"]
[null,"250","Kokosflocken","einrühren","zugeben unter ständigem rühren"]
[]
[]
[]
[]
[]
[]
[]
[]
[]
[]
[]
[]
[]
[]
[]
[null,"Beschreiben:"]
[null,"\nDas Formen ist mit einem Suppenlöffel einfacher!\nin der Mitte einfügen auf Backblech mit Backpapier\n\nBacken:\nCa. 5 Min. auf 250° in vorgeheitztem Backofen "]
[]
[]
[]
[]
[]
[]
[]
[]
[]
[]
[]
[null,"TIPP:"]
[null,"Lagerung:\n\nIn einem Tupperwaregefäss mit einem zitronenschnitz, dann bleiben sie länger Frisch und Saftig!"]
[]
[]
[]
[]
[]
[]
[null,{"$f":"TEXT(TODAY(),\"TT.MM.JJ\")&\"  © by mablu\"","v":"05.02.20  © by mablu"},null,{"$f":"CELL(\"Dateiname\",A1)","v":"C:\\Users\\MBDELL\\Documents\\Meine Rezepte\\[REZEPT-MB.xlsm]GP's Kokosmakronen"}]

{"sheet":"Wienerli im Teig","index":8,"n_rows":67,"n_cols":5,"rows_kept":67,"cut":false,"hidden":false,"merged":[[59,1,64,4],[66,1,66,2],[66,3,66,4],[2,1,2,3],[17,1,17,3],[23,1,23,4],[45,1,45,4],[46,1,56,4],[58,1,58,4]]}
[null,null,null,{"$f":"RIGHT(CELL(\"dateiname\",B1),LEN(CELL(\"dateiname\",B1))-FIND(\"]\",CELL(\"dateiname\",B1)))&\"  Rezept\"","v":"Wienerli im Teig  Rezept"}]
[]
[null,"MENUE"]
[]
[]
[]
[]
[]
[]
[]
[]
[]
[]
[]
[]
[]
[]
[null,"Wienerli im Teigmantel"]
[]
[null,"Für\nPersonen",null,4]
[]
[]
[]
[null,{"$f":"\"Zutaten für \"&D20&\" \"&B18","v":"Zutaten für 4 Wienerli im Teigmantel"}]
[]
[null,"Menge:","Menge:","Was:","Beschreibung:"]
[null,"8","Stk.","Wienerli","Auspacken trokenreiben"]
[null,"8","Scheiben","Käse","Scheiben Käre für hohe Temperaturen"]
[null,"1","Stk.","Ei","möglichst Frisch"]
[null,"1","Stk.","Blätterteig","ausgewahlt für grosses Backblech"]
[null,"1","Stk.","Backpapier","für unter die Wienerli weil der Käse ein wenig auslaufen kann"]
[]
[]
[]
[]
[]
[]
[]
[]
[]
[]
[]
[]
[]
[]
[null,"Beschreiben:"]
[null,"Blätterteig in ca. 3 cm breite Streifen schneiden mit Teigrad, es braucht am Schluss 8 Streifen!\nWienerli mit Käse ummanteln, und dann mit den Teigstreifen einwickeln.\nDarauf achten dass keine offenen Stellen sind wo der käse auslaufen könnte.\nBackpapier in Blech legen, darauf die Ummantelten Wienerli im Teig verteilen und mit Ei bestreichen.\n\nBackofen auf ca. 229° vorheizen\nDann auf mittlerer Höhe ca. 20 Minuten Backen"]
[]
[]
[]
[]
[]
[]
[]
[]
[]
[]
[]
[null,"TIPP:"]
[null,"Verzehr:\n\nMit Senf, Ketchup, Mayonnaise, Meerrettich oder anderes,\nwenn man es etwas deftiger mag, kann man auch mit Speck ummanteln anstelle Käse!"]
[]
[]
[]
[]
[]
[]
[null,{"$f":"TEXT(TODAY(),\"TT.MM.JJ\")&\"  © by mablu\"","v":"05.02.20  © by mablu"},null,{"$f":"CELL(\"Dateiname\",A1)","v":"C:\\Users\\MBDELL\\Documents\\Meine Rezepte\\[REZEPT-MB.xlsm]Wienerli im Teig"}]

{"sheet":"Pinos Focaccia","index":9,"n_rows":67,"n_cols":5,"rows_kept":67,"cut":false,"hidden":false,"merged":[[59,1,64,4],[66,1,66,2],[66,3,66,4],[2,1,2,3],[17,1,17,3],[23,1,23,4],[45,1,45,4],[46,1,56,4],[58,1,58,4]]}
[null,null,null,{"$f":"RIGHT(CELL(\"dateiname\",B1),LEN(CELL(\"dateiname\",B1))-FIND(\"]\",CELL(\"dateiname\",B1)))&\"  Rezept\"","v":"Pinos Focaccia  Rezept"}]
[]
[null,"MENUE"]
[]
[]
[]
[]
[]
[]
[]
[]
[]
[]
[]
[]
[]
[]
[null,"Focaccia von Pino"]
[]
[null,"Für\nPersonen",null,4]
[]
[]
[]
[null,{"$f":"\"Zutaten für \"&D20&\" \"&B18","v":"Zutaten für 4 Focaccia von Pino"}]
[]
[null,"Menge:","Menge:","Was:","Beschreibung:"]
[null,"500","gr.","Mehl"]
[null,"1.5","Teelöffel","Salz"]
[null,"20","gr.","Hele","eine halbe Portion"]
[null,"3.25","dl.","Wasser","lauwarm, mit Hefe auflösen"]
[null,"3","Esslöffel","Olivenöl","Jetzt alles mischen und Olivenöl beimengen und zu einem Teig verkneten"]
[null,"1","dl.","Olivenöl"]
[null,"5","Esslöffel","Rosmarinnadeln","zusammen mit dem dl Olivenäl erwärmen"]
[null,"0.5","Esslöffel","Salz","grobkörnig dazumischen"]
[]
[]
[]
[]
[]
[]
[]
[]
[]
[]
[]
[null,"Beschreiben:"]
[null,"Zubereitung:\n\nTeig ca. 1 Stunde aufgehen lassen. Bitte zudecken!\nTeig in 2 cm dick auswahlen und oben Kreuzweise einschneiden und mit Olivenöl bestreichen, ca mit der Hälfte Rosmarinöl.\nIm Vorgeheizten Ofen in der unteren Hälfte ca. 25 Min. backen.\nDanach mit dem Rest Rosmarinöl bestreichen fertig, en Guete"]
[]
[]
[]
[]
[]
[]
[]
[]
[]
[]
[]
[null,"TIPP:"]
[null,"Der Ursprung der Focaccia liegt inder RegionLigurien in Italien.\nAlternativ kann man auch noch mit Rosmarin bestreuen."]
[]
[]
[]
[]
[]
[]
[null,{"$f":"TEXT(TODAY(),\"TT.MM.JJ\")&\"  © by mablu\"","v":"05.02.20  © by mablu"},null,{"$f":"CELL(\"Dateiname\",A1)","v":"C:\\Users\\MBDELL\\Documents\\Meine Rezepte\\[REZEPT-MB.xlsm]Pinos Focaccia"}]

{"sheet":"Rhabarberwähe","index":10,"n_rows":67,"n_cols":5,"rows_kept":67,"cut":false,"hidden":false,"merged":[[59,1,64,4],[66,1,66,2],[66,3,66,4],[2,1,2,3],[17,1,17,3],[23,1,23,4],[45,1,45,4],[46,1,56,4],[58,1,58,4]]}
[null,null,null,{"$f":"RIGHT(CELL(\"dateiname\",B1),LEN(CELL(\"dateiname\",B1))-FIND(\"]\",CELL(\"dateiname\",B1)))&\"  Rezept\"","v":"Rhabarberwähe  Rezept"}]
[]
[null,"MENUE"]
[]
[]
[]
[]
[]
[]
[]
[]
[]
[]
[]
[]
[]
[]
[null,"Rhabarberwähe"]
[]
[null,"Für\nPersonen",null,4]
[]
[]
[]
[null,{"$f":"\"Zutaten für \"&D20&\" \"&B18","v":"Zutaten für 4 Rhabarberwähe"}]
[]
[null,"Menge:","Menge:","Was:","Beschreibung:"]
[null,"1","Stk.","Blätterteig","ausgewahlen 42 x 26 cm"]
[null,"3","Esslöffel","Haselnüsse","gemahlen"]
[null,"1","dl.","Sahne"]
[null,"1","dl.","Milch"]
[null,"100","gr.","Rahmquark"]
[null,"1/2","Teelöffel","Vanillepaste","(oder eine halbe Vanilleschote, davon das ausgekratzte Innere)"]
[null,"1","Esslöffel","Maisstärke ","(gehäuft)"]
[null,"4","Esslöffel","Zucker"]
[null,"5","Stk.","Rhabarber","stangen"]
[]
[]
[]
[]
[]
[]
[]
[]
[]
[]
[null,"Beschreiben:"]
[null,"Den Backofen auf 220 Grad vorheizen. Das Blech mit Backpapier auslegen und den Blätterteig darauf legen. Den Blätterteig mit einer Gabel locker verteilt einstechen. Die gemahlenen Haselnüsse auf dem Teig verteilen. Die Rhabarber rüsten und in Stücke schneiden. Die Rhabarberstücke auf dem Teig verteilen. Alle Zutaten für den Guss gut miteinander vermischen und vorsichtig über die Rhabarbern geben. Das Blech in die unterste Rille des Backofens schieben und für 30 bis 45 Minuten Backen. Dabei die Wähe im Auge behalten, damit sie nicht anbrennt. Nach der Backzeit die Wähe aus dem Ofen nehmen, etwas abkühlen lassen und aus dem Blech nehmen. Die Wähe lauwarm oder kalt servieren. "]
[]
[]
[]
[]
[]
[]
[]
[]
[]
[]
[]
[null,"TIPP:"]
[null,"Nach Belieben die Rhabarberwähe mit Puderzucker bestreuen."]
[]
[]
[]
[]
[]
[]
[null,{"$f":"TEXT(TODAY(),\"TT.MM.JJ\")&\"  © by mablu\"","v":"05.02.20  © by mablu"},null,{"$f":"CELL(\"Dateiname\",A1)","v":"C:\\Users\\MBDELL\\Documents\\Meine Rezepte\\[REZEPT-MB.xlsm]Rhabarberwähe"}]