{"text_format":"1","workbook":"xlsx","n_sheets":11,"sheets":["Verzeichnis","Allte Rezepte als Link","Wie geht's","Notizen","Daten","Vorlage","Butterzöpfe","GP's Kokosmakronen","Wienerli im Teig","Pinos Focaccia","Rhabarberwähe"],"not_rendered":{"charts":0,"images":18,"macros":1,"external_links":1,"defined_names":27,"comments":0,"pivot_tables":0},"unopened":[],"bounds":{"document_bytes":16777216,"sheet_cells":100000,"rows_first":2000,"rows_last":500,"rows_between":2000,"halvings":0,"cell_chars":16384,"cell_head_chars":4096},"cells_cut":0,"cells_raw":0,"read":"whole","date_system":"1900"}

{"sheet":"Verzeichnis","index":0,"n_rows":0,"n_cols":0,"rows_kept":0,"cut":false,"hidden":false,"merged":[]}

{"sheet":"Allte Rezepte als Link","index":1,"n_rows":491,"n_cols":2,"rows_kept":491,"cut":false,"hidden":false,"merged":[]}
[]
[]
[]
[]
[null,{"$f":"IF(ROW(A1)>COUNTA(x),\"\",HYPERLINK(\"#'\"&INDEX(x,ROW(A1))&\"'!A1\",MID(INDEX(x,ROW(A1)),FIND(\"]\",INDEX(x,ROW(A1)))+1,31)))","v":"Verzeichnis"}]
[null,{"$f":"IF(ROW(A2)>COUNTA(x),\"\",HYPERLINK(\"#'\"&INDEX(x,ROW(A2))&\"'!A1\",MID(INDEX(x,ROW(A2)),FIND(\"]\",INDEX(x,ROW(A2)))+1,31)))","v":"Allte Rezepte als Link"}]
[null,{"$f":"IF(ROW(A3)>COUNTA(x),\"\",HYPERLINK(\"#'\"&INDEX(x,ROW(A3))&\"'!A1\",MID(INDEX(x,ROW(A3)),FIND(\"]\",INDEX(x,ROW(A3)))+1,31)))","v":"Wie geht's"}]
[null,{"$f":"IF(ROW(A4)>COUNTA(x),\"\",HYPERLINK(\"#'\"&INDEX(x,ROW(A4))&\"'!A1\",MID(INDEX(x,ROW(A4)),FIND(\"]\",INDEX(x,ROW(A4)))+1,31)))","v":"Notizen"}]
[null,{"$f":"IF(ROW(A5)>COUNTA(x),\"\",HYPERLINK(\"#'\"&INDEX(x,ROW(A5))&\"'!A1\",MID(INDEX(x,ROW(A5)),FIND(\"]\",INDEX(x,ROW(A5)))+1,31)))","v":"Daten"}]
[null,{"$f":"IF(ROW(A6)>COUNTA(x),\"\",HYPERLINK(\"#'\"&INDEX(x,ROW(A6))&\"'!A1\",MID(INDEX(x,ROW(A6)),FIND(\"]\",INDEX(x,ROW(A6)))+1,31)))","v":"Vorlage"}]
[null,{"$f":"IF(ROW(A7)>COUNTA(x),\"\",HYPERLINK(\"#'\"&INDEX(x,ROW(A7))&\"'!A1\",MID(INDEX(x,ROW(A7)),FIND(\"]\",INDEX(x,ROW(A7)))+1,31)))","v":"Butterzöpfe"}]
[null,{"$f":"IF(ROW(A8)>COUNTA(x),\"\",HYPERLINK(\"#'\"&INDEX(x,ROW(A8))&\"'!A1\",MID(INDEX(x,ROW(A8)),FIND(\"]\",INDEX(x,ROW(A8)))+1,31)))","v":"GP's Kokosmakronen"}]
[null,{"$f":"IF(ROW(A9)>COUNTA(x),\"\",HYPERLINK(\"#'\"&INDEX(x,ROW(A9))&\"'!A1\",MID(INDEX(x,ROW(A9)),FIND(\"]\",INDEX(x,ROW(A9)))+1,31)))","v":"Wienerli im Teig"}]
[null,{"$f":"IF(ROW(A10)>COUNTA(x),\"\",HYPERLINK(\"#'\"&INDEX(x,ROW(A10))&\"'!A1\",MID(INDEX(x,ROW(A10)),FIND(\"]\",INDEX(x,ROW(A10)))+1,31)))","v":"Pinos Focaccia"}]
[null,{"$f":"IF(ROW(A11)>COUNTA(x),\"\",HYPERLINK(\"#'\"&INDEX(x,ROW(A11))&\"'!A1\",MID(INDEX(x,ROW(A11)),FIND(\"]\",INDEX(x,ROW(A11)))+1,31)))","v":"Rhabarberwähe"}]
[null,{"$f":"IF(ROW(A12)>COUNTA(x),\"\",HYPERLINK(\"#'\"&INDEX(x,ROW(A12))&\"'!A1\",MID(INDEX(x,ROW(A12)),FIND(\"]\",INDEX(x,ROW(A12)))+1,31)))","v":""}]
[null,{"$f":"IF(ROW(A13)>COUNTA(x),\"\",HYPERLINK(\"#'\"&INDEX(x,ROW(A13))&\"'!A1\",MID(INDEX(x,ROW(A13)),FIND(\"]\",INDEX(x,ROW(A13)))+1,31)))","v":""}]
[null,{"$f":"IF(ROW(A14)>COUNTA(x),\"\",HYPERLINK(\"#'\"&INDEX(x,ROW(A14))&\"'!A1\",MID(INDEX(x,ROW(A14)),FIND(\"]\",INDEX(x,ROW(A14)))+1,31)))","v":""}]
[null,{"$f":"IF(ROW(A15)>COUNTA(x),\"\",HYPERLINK(\"#'\"&INDEX(x,ROW(A15))&\"'!A1\",MID(INDEX(x,ROW(A15)),FIND(\"]\",INDEX(x,ROW(A15)))+1,31)))","v":""}]
[null,{"$f":"IF(ROW(A16)>COUNTA(x),\"\",HYPERLINK(\"#'\"&INDEX(x,ROW(A16))&\"'!A1\",MID(INDEX(x,ROW(A16)),FIND(\"]\",INDEX(x,ROW(A16)))+1,31)))","v":""}]
[null,{"$f":"IF(ROW(A17)>COUNTA(x),\"\",HYPERLINK(\"#'\"&INDEX(x,ROW(A17))&\"'!A1\",MID(INDEX(x,ROW(A17)),FIND(\"]\",INDEX(x,ROW(A17)))+1,31)))","v":""}]
[null,{"$f":"IF(ROW(A18)>COUNTA(x),\"\",HYPERLINK(\"#'\"&INDEX(x,ROW(A18))&\"'!A1\",MID(INDEX(x,ROW(A18)),FIND(\"]\",INDEX(x,ROW(A18)))+1,31)))","v":""}]
[null,{"$f":"IF(ROW(A19)>COUNTA(x),\"\",HYPERLINK(\"#'\"&INDEX(x,ROW(A19))&\"'!A1\",MID(INDEX(x,ROW(A19)),FIND(\"]\",INDEX(x,ROW(A19)))+1,31)))","v":""}]
[null,{"$f":"IF(ROW(A20)>COUNTA(x),\"\",HYPERLINK(\"#'\"&INDEX(x,ROW(A20))&\"'!A1\",MID(INDEX(x,ROW(A20)),FIND(\"]\",INDEX(x,ROW(A20)))+1,31)))","v":""}]
[null,{"$f":"IF(ROW(A21)>COUNTA(x),\"\",HYPERLINK(\"#'\"&INDEX(x,ROW(A21))&\"'!A1\",MID(INDEX(x,ROW(A21)),FIND(\"]\",INDEX(x,ROW(A21)))+1,31)))","v":""}]
[null,{"$f":"IF(ROW(A22)>COUNTA(x),\"\",HYPERLINK(\"#'\"&INDEX(x,ROW(A22))&\"'!A1\",MID(INDEX(x,ROW(A22)),FIND(\"]\",INDEX(x,ROW(A22)))+1,31)))","v":""}]
[null,{"$f":"IF(ROW(A23)>COUNTA(x),\"\",HYPERLINK(\"#'\"&INDEX(x,ROW(A23))&\"'!A1\",MID(INDEX(x,ROW(A23)),FIND(\"]\",INDEX(x,ROW(A23)))+1,31)))","v":""}]
[null,{"$f":"IF(ROW(A24)>COUNTA(x),\"\",HYPERLINK(\"#'\"&INDEX(x,ROW(A24))&\"'!A1\",MID(INDEX(x,ROW(A24)),FIND(\"]\",INDEX(x,ROW(A24)))+1,31)))","v":""}]
[null,{"$f":"IF(ROW(A25)>COUNTA(x),\"\",HYPERLINK(\"#'\"&INDEX(x,ROW(A25))&\"'!A1\",MID(INDEX(x,ROW(A25)),FIND(\"]\",INDEX(x,ROW(A25)))+1,31)))","v":""}]
[null,{"$f":"IF(ROW(A26)>COUNTA(x),\"\",HYPERLINK(\"#'\"&INDEX(x,ROW(A26))&\"'!A1\",MID(INDEX(x,ROW(A26)),FIND(\"]\",INDEX(x,ROW(A26)))+1,31)))","v":""}]
[null,{"$f":"IF(ROW(A27)>COUNTA(x),\"\",HYPERLINK(\"#'\"&INDEX(x,ROW(A27))&\"'!A1\",MID(INDEX(x,ROW(A27)),FIND(\"]\",INDEX(x,ROW(A27)))+1,31)))","v":""}]
[null,{"$f":"IF(ROW(A28)>COUNTA(x),\"\",HYPERLINK(\"#'\"&INDEX(x,ROW(A28))&\"'!A1\",MID(INDEX(x,ROW(A28)),FIND(\"]\",INDEX(x,ROW(A28)))+1,31)))","v":""}]
[null,{"$f":"IF(ROW(A29)>COUNTA(x),\"\",HYPERLINK(\"#'\"&INDEX(x,ROW(A29))&\"'!A1\",MID(INDEX(x,ROW(A29)),FIND(\"]\",INDEX(x,ROW(A29)))+1,31)))","v":""}]
[null,{"$f":"IF(ROW(A30)>COUNTA(x),\"\",HYPERLINK(\"#'\"&INDEX(x,ROW(A30))&\"'!A1\",MID(INDEX(x,ROW(A30)),FIND(\"]\",INDEX(x,ROW(A30)))+1,31)))","v":""}]
[null,{"$f":"IF(ROW(A31)>COUNTA(x),\"\",HYPERLINK(\"#'\"&INDEX(x,ROW(A31))&\"'!A1\",MID(INDEX(x,ROW(A31)),FIND(\"]\",INDEX(x,ROW(A31)))+1,31)))","v":""}]
[null,{"$f":"IF(ROW(A32)>COUNTA(x),\"\",HYPERLINK(\"#'\"&INDEX(x,ROW(A32))&\"'!A1\",MID(INDEX(x,ROW(A32)),FIND(\"]\",INDEX(x,ROW(A32)))+1,31)))","v":""}]
[null,{"$f":"IF(ROW(A33)>COUNTA(x),\"\",HYPERLINK(\"#'\"&INDEX(x,ROW(A33))&\"'!A1\",MID(INDEX(x,ROW(A33)),FIND(\"]\",INDEX(x,ROW(A33)))+1,31)))","v":""}]
[null,{"$f":"IF(ROW(A34)>COUNTA(x),\"\",HYPERLINK(\"#'\"&INDEX(x,ROW(A34))&\"'!A1\",MID(INDEX(x,ROW(A34)),FIND(\"]\",INDEX(x,ROW(A34)))+1,31)))","v":""}]
[null,{"$f":"IF(ROW(A35)>COUNTA(x),\"\",HYPERLINK(\"#'\"&INDEX(x,ROW(A35))&\"'!A1\",MID(INDEX(x,ROW(A35)),FIND(\"]\",INDEX(x,ROW(A35)))+1,31)))","v":""}]
[null,{"$f":"IF(ROW(A36)>COUNTA(x),\"\",HYPERLINK(\"#'\"&INDEX(x,ROW(A36))&\"'!A1\",MID(INDEX(x,ROW(A36)),FIND(\"]\",INDEX(x,ROW(A36)))+1,31)))","v":""}]
[null,{"$f":"IF(ROW(A37)>COUNTA(x),\"\",HYPERLINK(\"#'\"&INDEX(x,ROW(A37))&\"'!A1\",MID(INDEX(x,ROW(A37)),FIND(\"]\",INDEX(x,ROW(A37)))+1,31)))","v":""}]
[null,{"$f":"IF(ROW(A38)>COUNTA(x),\"\",HYPERLINK(\"#'\"&INDEX(x,ROW(A38))&\"'!A1\",MID(INDEX(x,ROW(A38)),FIND(\"]\",INDEX(x,ROW(A38)))+1,31)))","v":""}]
[null,{"$f":"IF(ROW(A39)>COUNTA(x),\"\",HYPERLINK(\"#'\"&INDEX(x,ROW(A39))&\"'!A1\",MID(INDEX(x,ROW(A39)),FIND(\"]\",INDEX(x,ROW(A39)))+1,31)))","v":""}]
[null,{"$f":"IF(ROW(A40)>COUNTA(x),\"\",HYPERLINK(\"#'\"&INDEX(x,ROW(A40))&\"'!A1\",MID(INDEX(x,ROW(A40)),FIND(\"]\",INDEX(x,ROW(A40)))+1,31)))","v":""}]
[null,{"$f":"IF(ROW(A41)>COUNTA(x),\"\",HYPERLINK(\"#'\"&INDEX(x,ROW(A41))&\"'!A1\",MID(INDEX(x,ROW(A41)),FIND(\"]\",INDEX(x,ROW(A41)))+1,31)))","v":""}]
[null,{"$f":"IF(ROW(A42)>COUNTA(x),\"\",HYPERLINK(\"#'\"&INDEX(x,ROW(A42))&\"'!A1\",MID(INDEX(x,ROW(A42)),FIND(\"]\",INDEX(x,ROW(A42)))+1,31)))","v":""}]
[null,{"$f":"IF(ROW(A43)>COUNTA(x),\"\",HYPERLINK(\"#'\"&INDEX(x,ROW(A43))&\"'!A1\",MID(INDEX(x,ROW(A43)),FIND(\"]\",INDEX(x,ROW(A43)))+1,31)))","v":""}]
[null,{"$f":"IF(ROW(A44)>COUNTA(x),\"\",HYPERLINK(\"#'\"&INDEX(x,ROW(A44))&\"'!A1\",MID(INDEX(x,ROW(A44)),FIND(\"]\",INDEX(x,ROW(A44)))+1,31)))","v":""}]
[null,{"$f":"IF(ROW(A45)>COUNTA(x),\"\",HYPERLINK(\"#'\"&INDEX(x,ROW(A45))&\"'!A1\",MID(INDEX(x,ROW(A45)),FIND(\"]\",INDEX(x,ROW(A45)))+1,31)))","v":""}]
[null,{"$f":"IF(ROW(A46)>COUNTA(x),\"\",HYPERLINK(\"#'\"&INDEX(x,ROW(A46))&\"'!A1\",MID(INDEX(x,ROW(A46)),FIND(\"]\",INDEX(x,ROW(A46)))+1,31)))","v":""}]
[null,{"$f":"IF(ROW(A47)>COUNTA(x),\"\",HYPERLINK(\"#'\"&INDEX(x,ROW(A47))&\"'!A1\",MID(INDEX(x,ROW(A47)),FIND(\"]\",INDEX(x,ROW(A47)))+1,31)))","v":""}]
[null,{"$f":"IF(ROW(A48)>COUNTA(x),\"\",HYPERLINK(\"#'\"&INDEX(x,ROW(A48))&\"'!A1\",MID(INDEX(x,ROW(A48)),FIND(\"]\",INDEX(x,ROW(A48)))+1,31)))","v":""}]
[null,{"$f":"IF(ROW(A49)>COUNTA(x),\"\",HYPERLINK(\"#'\"&INDEX(x,ROW(A49))&\"'!A1\",MID(INDEX(x,ROW(A49)),FIND(\"]\",INDEX(x,ROW(A49)))+1,31)))","v":""}]
[null,{"$f":"IF(ROW(A50)>COUNTA(x),\"\",HYPERLINK(\"#'\"&INDEX(x,ROW(A50))&\"'!A1\",MID(INDEX(x,ROW(A50)),FIND(\"]\",INDEX(x,ROW(A50)))+1,31)))","v":""}]
[null,{"$f":"IF(ROW(A51)>COUNTA(x),\"\",HYPERLINK(\"#'\"&INDEX(x,ROW(A51))&\"'!A1\",MID(INDEX(x,ROW(A51)),FIND(\"]\",INDEX(x,ROW(A51)))+1,31)))","v":""}]
[null,{"$f":"IF(ROW(A52)>COUNTA(x),\"\",HYPERLINK(\"#'\"&INDEX(x,ROW(A52))&\"'!A1\",MID(INDEX(x,ROW(A52)),FIND(\"]\",INDEX(x,ROW(A52)))+1,31)))","v":""}]
[null,{"$f":"IF(ROW(A53)>COUNTA(x),\"\",HYPERLINK(\"#'\"&INDEX(x,ROW(A53))&\"'!A1\",MID(INDEX(x,ROW(A53)),FIND(\"]\",INDEX(x,ROW(A53)))+1,31)))","v":""}]
[null,{"$f":"IF(ROW(A54)>COUNTA(x),\"\",HYPERLINK(\"#'\"&INDEX(x,ROW(A54))&\"'!A1\",MID(INDEX(x,ROW(A54)),FIND(\"]\",INDEX(x,ROW(A54)))+1,31)))","v":""}]
[null,{"$f":"IF(ROW(A55)>COUNTA(x),\"\",HYPERLINK(\"#'\"&INDEX(x,ROW(A55))&\"'!A1\",MID(INDEX(x,ROW(A55)),FIND(\"]\",INDEX(x,ROW(A55)))+1,31)))","v":""}]
[null,{"$f":"IF(ROW(A56)>COUNTA(x),\"\",HYPERLINK(\"#'\"&INDEX(x,ROW(A56))&\"'!A1\",MID(INDEX(x,ROW(A56)),FIND(\"]\",INDEX(x,ROW(A56)))+1,31)))","v":""}]
[null,{"$f":"IF(ROW(A57)>COUNTA(x),\"\",HYPERLINK(\"#'\"&INDEX(x,ROW(A57))&\"'!A1\",MID(INDEX(x,ROW(A57)),FIND(\"]\",INDEX(x,ROW(A57)))+1,31)))","v":""}]
[null,{"$f":"IF(ROW(A58)>COUNTA(x),\"\",HYPERLINK(\"#'\"&INDEX(x,ROW(A58))&\"'!A1\",MID(INDEX(x,ROW(A58)),FIND(\"]\",INDEX(x,ROW(A58)))+1,31)))","v":""}]
[null,{"$f":"IF(ROW(A59)>COUNTA(x),\"\",HYPERLINK(\"#'\"&INDEX(x,ROW(A59))&\"'!A1\",MID(INDEX(x,ROW(A59)),FIND(\"]\",INDEX(x,ROW(A59)))+1,31)))","v":""}]
[null,{"$f":"IF(ROW(A60)>COUNTA(x),\"\",HYPERLINK(\"#'\"&INDEX(x,ROW(A60))&\"'!A1\",MID(INDEX(x,ROW(A60)),FIND(\"]\",INDEX(x,ROW(A60)))+1,31)))","v":""}]
[null,{"$f":"IF(ROW(A61)>COUNTA(x),\"\",HYPERLINK(\"#'\"&INDEX(x,ROW(A61))&\"'!A1\",MID(INDEX(x,ROW(A61)),FIND(\"]\",INDEX(x,ROW(A61)))+1,31)))","v":""}]
[null,{"$f":"IF(ROW(A62)>COUNTA(x),\"\",HYPERLINK(\"#'\"&INDEX(x,ROW(A62))&\"'!A1\",MID(INDEX(x,ROW(A62)),FIND(\"]\",INDEX(x,ROW(A62)))+1,31)))","v":""}]
[null,{"$f":"IF(ROW(A63)>COUNTA(x),\"\",HYPERLINK(\"#'\"&INDEX(x,ROW(A63))&\"'!A1\",MID(INDEX(x,ROW(A63)),FIND(\"]\",INDEX(x,ROW(A63)))+1,31)))","v":""}]
[null,{"$f":"IF(ROW(A64)>COUNTA(x),\"\",HYPERLINK(\"#'\"&INDEX(x,ROW(A64))&\"'!A1\",MID(INDEX(x,ROW(A64)),FIND(\"]\",INDEX(x,ROW(A64)))+1,31)))","v":""}]
[null,{"$f":"IF(ROW(A65)>COUNTA(x),\"\",HYPERLINK(\"#'\"&INDEX(x,ROW(A65))&\"'!A1\",MID(INDEX(x,ROW(A65)),FIND(\"]\",INDEX(x,ROW(A65)))+1,31)))","v":""}]
[null,{"$f":"IF(ROW(A66)>COUNTA(x),\"\",HYPERLINK(\"#'\"&INDEX(x,ROW(A66))&\"'!A1\",MID(INDEX(x,ROW(A66)),FIND(\"]\",INDEX(x,ROW(A66)))+1,31)))","v":""}]
[null,{"$f":"IF(ROW(A67)>COUNTA(x),\"\",HYPERLINK(\"#'\"&INDEX(x,ROW(A67))&\"'!A1\",MID(INDEX(x,ROW(A67)),FIND(\"]\",INDEX(x,ROW(A67)))+1,31)))","v":""}]
[null,{"$f":"IF(ROW(A68)>COUNTA(x),\"\",HYPERLINK(\"#'\"&INDEX(x,ROW(A68))&\"'!A1\",MID(INDEX(x,ROW(A68)),FIND(\"]\",INDEX(x,ROW(A68)))+1,31)))","v":""}]
[null,{"$f":"IF(ROW(A69)>COUNTA(x),\"\",HYPERLINK(\"#'\"&INDEX(x,ROW(A69))&\"'!A1\",MID(INDEX(x,ROW(A69)),FIND(\"]\",INDEX(x,ROW(A69)))+1,31)))","v":""}]
[null,{"$f":"IF(ROW(A70)>COUNTA(x),\"\",HYPERLINK(\"#'\"&INDEX(x,ROW(A70))&\"'!A1\",MID(INDEX(x,ROW(A70)),FIND(\"]\",INDEX(x,ROW(A70)))+1,31)))","v":""}]
[null,{"$f":"IF(ROW(A71)>COUNTA(x),\"\",HYPERLINK(\"#'\"&INDEX(x,ROW(A71))&\"'!A1\",MID(INDEX(x,ROW(A71)),FIND(\"]\",INDEX(x,ROW(A71)))+1,31)))","v":""}]
[null,{"$f":"IF(ROW(A72)>COUNTA(x),\"\",HYPERLINK(\"#'\"&INDEX(x,ROW(A72))&\"'!A1\",MID(INDEX(x,ROW(A72)),FIND(\"]\",INDEX(x,ROW(A72)))+1,31)))","v":""}]
[null,{"$f":"IF(ROW(A73)>COUNTA(x),\"\",HYPERLINK(\"#'\"&INDEX(x,ROW(A73))&\"'!A1\",MID(INDEX(x,ROW(A73)),FIND(\"]\",INDEX(x,ROW(A73)))+1,31)))","v":""}]
[null,{"$f":"IF(ROW(A74)>COUNTA(x),\"\",HYPERLINK(\"#'\"&INDEX(x,ROW(A74))&\"'!A1\",MID(INDEX(x,ROW(A74)),FIND(\"]\",INDEX(x,ROW(A74)))+1,31)))","v":""}]
[null,{"$f":"IF(ROW(A75)>COUNTA(x),\"\",HYPERLINK(\"#'\"&INDEX(x,ROW(A75))&\"'!A1\",MID(INDEX(x,ROW(A75)),FIND(\"]\",INDEX(x,ROW(A75)))+1,31)))","v":""}]
[null,{"$f":"IF(ROW(A76)>COUNTA(x),\"\",HYPERLINK(\"#'\"&INDEX(x,ROW(A76))&\"'!A1\",MID(INDEX(x,ROW(A76)),FIND(\"]\",INDEX(x,ROW(A76)))+1,31)))","v":""}]
[null,{"$f":"IF(ROW(A77)>COUNTA(x),\"\",HYPERLINK(\"#'\"&INDEX(x,ROW(A77))&\"'!A1\",MID(INDEX(x,ROW(A77)),FIND(\"]\",INDEX(x,ROW(A77)))+1,31)))","v":""}]
[null,{"$f":"IF(ROW(A78)>COUNTA(x),\"\",HYPERLINK(\"#'\"&INDEX(x,ROW(A78))&\"'!A1\",MID(INDEX(x,ROW(A78)),FIND(\"]\",INDEX(x,ROW(A78)))+1,31)))","v":""}]
[null,{"$f":"IF(ROW(A79)>COUNTA(x),\"\",HYPERLINK(\"#'\"&INDEX(x,ROW(A79))&\"'!A1\",MID(INDEX(x,ROW(A79)),FIND(\"]\",INDEX(x,ROW(A79)))+1,31)))","v":""}]
[null,{"$f":"IF(ROW(A80)>COUNTA(x),\"\",HYPERLINK(\"#'\"&INDEX(x,ROW(A80))&\"'!A1\",MID(INDEX(x,ROW(A80)),FIND(\"]\",INDEX(x,ROW(A80)))+1,31)))","v":""}]
[null,{"$f":"IF(ROW(A81)>COUNTA(x),\"\",HYPERLINK(\"#'\"&INDEX(x,ROW(A81))&\"'!A1\",MID(INDEX(x,ROW(A81)),FIND(\"]\",INDEX(x,ROW(A81)))+1,31)))","v":""}]
[null,{"$f":"IF(ROW(A82)>COUNTA(x),\"\",HYPERLINK(\"#'\"&INDEX(x,ROW(A82))&\"'!A1\",MID(INDEX(x,ROW(A82)),FIND(\"]\",INDEX(x,ROW(A82)))+1,31)))","v":""}]
[null,{"$f":"IF(ROW(A83)>COUNTA(x),\"\",HYPERLINK(\"#'\"&INDEX(x,ROW(A83))&\"'!A1\",MID(INDEX(x,ROW(A83)),FIND(\"]\",INDEX(x,ROW(A83)))+1,31)))","v":""}]
[null,{"$f":"IF(ROW(A84)>COUNTA(x),\"\",HYPERLINK(\"#'\"&INDEX(x,ROW(A84))&\"'!A1\",MID(INDEX(x,ROW(A84)),FIND(\"]\",INDEX(x,ROW(A84)))+1,31)))","v":""}]
[null,{"$f":"IF(ROW(A85)>COUNTA(x),\"\",HYPERLINK(\"#'\"&INDEX(x,ROW(A85))&\"'!A1\",MID(INDEX(x,ROW(A85)),FIND(\"]\",INDEX(x,ROW(A85)))+1,31)))","v":""}]
[null,{"$f":"IF(ROW(A86)>COUNTA(x),\"\",HYPERLINK(\"#'\"&INDEX(x,ROW(A86))&\"'!A1\",MID(INDEX(x,ROW(A86)),FIND(\"]\",INDEX(x,ROW(A86)))+1,31)))","v":""}]
[null,{"$f":"IF(ROW(A87)>COUNTA(x),\"\",HYPERLINK(\"#'\"&INDEX(x,ROW(A87))&\"'!A1\",MID(INDEX(x,ROW(A87)),FIND(\"]\",INDEX(x,ROW(A87)))+1,31)))","v":""}]
[null,{"$f":"IF(ROW(A88)>COUNTA(x),\"\",HYPERLINK(\"#'\"&INDEX(x,ROW(A88))&\"'!A1\",MID(INDEX(x,ROW(A88)),FIND(\"]\",INDEX(x,ROW(A88)))+1,31)))","v":""}]
[null,{"$f":"IF(ROW(A89)>COUNTA(x),\"\",HYPERLINK(\"#'\"&INDEX(x,ROW(A89))&\"'!A1\",MID(INDEX(x,ROW(A89)),FIND(\"]\",INDEX(x,ROW(A89)))+1,31)))","v":""}]
[null,{"$f":"IF(ROW(A90)>COUNTA(x),\"\",HYPERLINK(\"#'\"&INDEX(x,ROW(A90))&\"'!A1\",MID(INDEX(x,ROW(A90)),FIND(\"]\",INDEX(x,ROW(A90)))+1,31)))","v":""}]
[null,{"$f":"IF(ROW(A91)>COUNTA(x),\"\",HYPERLINK(\"#'\"&INDEX(x,ROW(A91))&\"'!A1\",MID(INDEX(x,ROW(A91)),FIND(\"]\",INDEX(x,ROW(A91)))+1,31)))","v":""}]
[null,{"$f":"IF(ROW(A92)>COUNTA(x),\"\",HYPERLINK(\"#'\"&INDEX(x,ROW(A92))&\"'!A1\",MID(INDEX(x,ROW(A92)),FIND(\"]\",INDEX(x,ROW(A92)))+1,31)))","v":""}]
[null,{"$f":"IF(ROW(A93)>COUNTA(x),\"\",HYPERLINK(\"#'\"&INDEX(x,ROW(A93))&\"'!A1\",MID(INDEX(x,ROW(A93)),FIND(\"]\",INDEX(x,ROW(A93)))+1,31)))","v":""}]
[null,{"$f":"IF(ROW(A94)>COUNTA(x),\"\",HYPERLINK(\"#'\"&INDEX(x,ROW(A94))&\"'!A1\",MID(INDEX(x,ROW(A94)),FIND(\"]\",INDEX(x,ROW(A94)))+1,31)))","v":""}]
[null,{"$f":"IF(ROW(A95)>COUNTA(x),\"\",HYPERLINK(\"#'\"&INDEX(x,ROW(A95))&\"'!A1\",MID(INDEX(x,ROW(A95)),FIND(\"]\",INDEX(x,ROW(A95)))+1,31)))","v":""}]
[null,{"$f":"IF(ROW(A96)>COUNTA(x),\"\",HYPERLINK(\"#'\"&INDEX(x,ROW(A96))&\"'!A1\",MID(INDEX(x,ROW(A96)),FIND(\"]\",INDEX(x,ROW(A96)))+1,31)))","v":""}]
[null,{"$f":"IF(ROW(A97)>COUNTA(x),\"\",HYPERLINK(\"#'\"&INDEX(x,ROW(A97))&\"'!A1\",MID(INDEX(x,ROW(A97)),FIND(\"]\",INDEX(x,ROW(A97)))+1,31)))","v":""}]
[null,{"$f":"IF(ROW(A98)>COUNTA(x),\"\",HYPERLINK(\"#'\"&INDEX(x,ROW(A98))&\"'!A1\",MID(INDEX(x,ROW(A98)),FIND(\"]\",INDEX(x,ROW(A98)))+1,31)))","v":""}]
[null,{"$f":"IF(ROW(A99)>COUNTA(x),\"\",HYPERLINK(\"#'\"&INDEX(x,ROW(A99))&\"'!A1\",MID(INDEX(x,ROW(A99)),FIND(\"]\",INDEX(x,ROW(A99)))+1,31)))","v":""}]
[null,{"$f":"IF(ROW(A100)>COUNTA(x),\"\",HYPERLINK(\"#'\"&INDEX(x,ROW(A100))&\"'!A1\",MID(INDEX(x,ROW(A100)),FIND(\"]\",INDEX(x,ROW(A100)))+1,31)))","v":""}]
[null,{"$f":"IF(ROW(A101)>COUNTA(x),\"\",HYPERLINK(\"#'\"&INDEX(x,ROW(A101))&\"'!A1\",MID(INDEX(x,ROW(A101)),FIND(\"]\",INDEX(x,ROW(A101)))+1,31)))","v":""}]
[null,{"$f":"IF(ROW(A102)>COUNTA(x),\"\",HYPERLINK(\"#'\"&INDEX(x,ROW(A102))&\"'!A1\",MID(INDEX(x,ROW(A102)),FIND(\"]\",INDEX(x,ROW(A102)))+1,31)))","v":""}]
[null,{"$f":"IF(ROW(A103)>COUNTA(x),\"\",HYPERLINK(\"#'\"&INDEX(x,ROW(A103))&\"'!A1\",MID(INDEX(x,ROW(A103)),FIND(\"]\",INDEX(x,ROW(A103)))+1,31)))","v":""}]
[null,{"$f":"IF(ROW(A104)>COUNTA(x),\"\",HYPERLINK(\"#'\"&INDEX(x,ROW(A104))&\"'!A1\",MID(INDEX(x,ROW(A104)),FIND(\"]\",INDEX(x,ROW(A104)))+1,31)))","v":""}]
[null,{"$f":"IF(ROW(A105)>COUNTA(x),\"\",HYPERLINK(\"#'\"&INDEX(x,ROW(A105))&\"'!A1\",MID(INDEX(x,ROW(A105)),FIND(\"]\",INDEX(x,ROW(A105)))+1,31)))","v":""}]
[null,{"$f":"IF(ROW(A106)>COUNTA(x),\"\",HYPERLINK(\"#'\"&INDEX(x,ROW(A106))&\"'!A1\",MID(INDEX(x,ROW(A106)),FIND(\"]\",INDEX(x,ROW(A106)))+1,31)))","v":""}]
[null,{"$f":"IF(ROW(A107)>COUNTA(x),\"\",HYPERLINK(\"#'\"&INDEX(x,ROW(A107))&\"'!A1\",MID(INDEX(x,ROW(A107)),FIND(\"]\",INDEX(x,ROW(A107)))+1,31)))","v":""}]
[null,{"$f":"IF(ROW(A108)>COUNTA(x),\"\",HYPERLINK(\"#'\"&INDEX(x,ROW(A108))&\"'!A1\",MID(INDEX(x,ROW(A108)),FIND(\"]\",INDEX(x,ROW(A108)))+1,31)))","v":""}]
[null,{"$f":"IF(ROW(A109)>COUNTA(x),\"\",HYPERLINK(\"#'\"&INDEX(x,ROW(A109))&\"'!A1\",MID(INDEX(x,ROW(A109)),FIND(\"]\",INDEX(x,ROW(A109)))+1,31)))","v":""}]
[null,{"$f":"IF(ROW(A110)>COUNTA(x),\"\",HYPERLINK(\"#'\"&INDEX(x,ROW(A110))&\"'!A1\",MID(INDEX(x,ROW(A110)),FIND(\"]\",INDEX(x,ROW(A110)))+1,31)))","v":""}]
[null,{"$f":"IF(ROW(A111)>COUNTA(x),\"\",HYPERLINK(\"#'\"&INDEX(x,ROW(A111))&\"'!A1\",MID(INDEX(x,ROW(A111)),FIND(\"]\",INDEX(x,ROW(A111)))+1,31)))","v":""}]
[null,{"$f":"IF(ROW(A112)>COUNTA(x),\"\",HYPERLINK(\"#'\"&INDEX(x,ROW(A112))&\"'!A1\",MID(INDEX(x,ROW(A112)),FIND(\"]\",INDEX(x,ROW(A112)))+1,31)))","v":""}]
[null,{"$f":"IF(ROW(A113)>COUNTA(x),\"\",HYPERLINK(\"#'\"&INDEX(x,ROW(A113))&\"'!A1\",MID(INDEX(x,ROW(A113)),FIND(\"]\",INDEX(x,ROW(A113)))+1,31)))","v":""}]
[null,{"$f":"IF(ROW(A114)>COUNTA(x),\"\",HYPERLINK(\"#'\"&INDEX(x,ROW(A114))&\"'!A1\",MID(INDEX(x,ROW(A114)),FIND(\"]\",INDEX(x,ROW(A114)))+1,31)))","v":""}]
[null,{"$f":"IF(ROW(A115)>COUNTA(x),\"\",HYPERLINK(\"#'\"&INDEX(x,ROW(A115))&\"'!A1\",MID(INDEX(x,ROW(A115)),FIND(\"]\",INDEX(x,ROW(A115)))+1,31)))","v":""}]
[null,{"$f":"IF(ROW(A116)>COUNTA(x),\"\",HYPERLINK(\"#'\"&INDEX(x,ROW(A116))&\"'!A1\",MID(INDEX(x,ROW(A116)),FIND(\"]\",INDEX(x,ROW(A116)))+1,31)))","v":""}]
[null,{"$f":"IF(ROW(A117)>COUNTA(x),\"\",HYPERLINK(\"#'\"&INDEX(x,ROW(A117))&\"'!A1\",MID(INDEX(x,ROW(A117)),FIND(\"]\",INDEX(x,ROW(A117)))+1,31)))","v":""}]
[null,{"$f":"IF(ROW(A118)>COUNTA(x),\"\",HYPERLINK(\"#'\"&INDEX(x,ROW(A118))&\"'!A1\",MID(INDEX(x,ROW(A118)),FIND(\"]\",INDEX(x,ROW(A118)))+1,31)))","v":""}]
[null,{"$f":"IF(ROW(A119)>COUNTA(x),\"\",HYPERLINK(\"#'\"&INDEX(x,ROW(A119))&\"'!A1\",MID(INDEX(x,ROW(A119)),FIND(\"]\",INDEX(x,ROW(A119)))+1,31)))","v":""}]
[null,{"$f":"IF(ROW(A120)>COUNTA(x),\"\",HYPERLINK(\"#'\"&INDEX(x,ROW(A120))&\"'!A1\",MID(INDEX(x,ROW(A120)),FIND(\"]\",INDEX(x,ROW(A120)))+1,31)))","v":""}]
[null,{"$f":"IF(ROW(A121)>COUNTA(x),\"\",HYPERLINK(\"#'\"&INDEX(x,ROW(A121))&\"'!A1\",MID(INDEX(x,ROW(A121)),FIND(\"]\",INDEX(x,ROW(A121)))+1,31)))","v":""}]
[null,{"$f":"IF(ROW(A122)>COUNTA(x),\"\",HYPERLINK(\"#'\"&INDEX(x,ROW(A122))&\"'!A1\",MID(INDEX(x,ROW(A122)),FIND(\"]\",INDEX(x,ROW(A122)))+1,31)))","v":""}]
[null,{"$f":"IF(ROW(A123)>COUNTA(x),\"\",HYPERLINK(\"#'\"&INDEX(x,ROW(A123))&\"'!A1\",MID(INDEX(x,ROW(A123)),FIND(\"]\",INDEX(x,ROW(A123)))+1,31)))","v":""}]
[null,{"$f":"IF(ROW(A124)>COUNTA(x),\"\",HYPERLINK(\"#'\"&INDEX(x,ROW(A124))&\"'!A1\",MID(INDEX(x,ROW(A124)),FIND(\"]\",INDEX(x,ROW(A124)))+1,31)))","v":""}]
[null,{"$f":"IF(ROW(A125)>COUNTA(x),\"\",HYPERLINK(\"#'\"&INDEX(x,ROW(A125))&\"'!A1\",MID(INDEX(x,ROW(A125)),FIND(\"]\",INDEX(x,ROW(A125)))+1,31)))","v":""}]
[null,{"$f":"IF(ROW(A126)>COUNTA(x),\"\",HYPERLINK(\"#'\"&INDEX(x,ROW(A126))&\"'!A1\",MID(INDEX(x,ROW(A126)),FIND(\"]\",INDEX(x,ROW(A126)))+1,31)))","v":""}]
[null,{"$f":"IF(ROW(A127)>COUNTA(x),\"\",HYPERLINK(\"#'\"&INDEX(x,ROW(A127))&\"'!A1\",MID(INDEX(x,ROW(A127)),FIND(\"]\",INDEX(x,ROW(A127)))+1,31)))","v":""}]
[null,{"$f":"IF(ROW(A128)>COUNTA(x),\"\",HYPERLINK(\"#'\"&INDEX(x,ROW(A128))&\"'!A1\",MID(INDEX(x,ROW(A128)),FIND(\"]\",INDEX(x,ROW(A128)))+1,31)))","v":""}]
[null,{"$f":"IF(ROW(A129)>COUNTA(x),\"\",HYPERLINK(\"#'\"&INDEX(x,ROW(A129))&\"'!A1\",MID(INDEX(x,ROW(A129)),FIND(\"]\",INDEX(x,ROW(A129)))+1,31)))","v":""}]
[null,{"$f":"IF(ROW(A130)>COUNTA(x),\"\",HYPERLINK(\"#'\"&INDEX(x,ROW(A130))&\"'!A1\",MID(INDEX(x,ROW(A130)),FIND(\"]\",INDEX(x,ROW(A130)))+1,31)))","v":""}]
[null,{"$f":"IF(ROW(A131)>COUNTA(x),\"\",HYPERLINK(\"#'\"&INDEX(x,ROW(A131))&\"'!A1\",MID(INDEX(x,ROW(A131)),FIND(\"]\",INDEX(x,ROW(A131)))+1,31)))","v":""}]
[null,{"$f":"IF(ROW(A132)>COUNTA(x),\"\",HYPERLINK(\"#'\"&INDEX(x,ROW(A132))&\"'!A1\",MID(INDEX(x,ROW(A132)),FIND(\"]\",INDEX(x,ROW(A132)))+1,31)))","v":""}]
[null,{"$f":"IF(ROW(A133)>COUNTA(x),\"\",HYPERLINK(\"#'\"&INDEX(x,ROW(A133))&\"'!A1\",MID(INDEX(x,ROW(A133)),FIND(\"]\",INDEX(x,ROW(A133)))+1,31)))","v":""}]
[null,{"$f":"IF(ROW(A134)>COUNTA(x),\"\",HYPERLINK(\"#'\"&INDEX(x,ROW(A134))&\"'!A1\",MID(INDEX(x,ROW(A134)),FIND(\"]\",INDEX(x,ROW(A134)))+1,31)))","v":""}]
[null,{"$f":"IF(ROW(A135)>COUNTA(x),\"\",HYPERLINK(\"#'\"&INDEX(x,ROW(A135))&\"'!A1\",MID(INDEX(x,ROW(A135)),FIND(\"]\",INDEX(x,ROW(A135)))+1,31)))","v":""}]
[null,{"$f":"IF(ROW(A136)>COUNTA(x),\"\",HYPERLINK(\"#'\"&INDEX(x,ROW(A136))&\"'!A1\",MID(INDEX(x,ROW(A136)),FIND(\"]\",INDEX(x,ROW(A136)))+1,31)))","v":""}]
[null,{"$f":"IF(ROW(A137)>COUNTA(x),\"\",HYPERLINK(\"#'\"&INDEX(x,ROW(A137))&\"'!A1\",MID(INDEX(x,ROW(A137)),FIND(\"]\",INDEX(x,ROW(A137)))+1,31)))","v":""}]
[null,{"$f":"IF(ROW(A138)>COUNTA(x),\"\",HYPERLINK(\"#'\"&INDEX(x,ROW(A138))&\"'!A1\",MID(INDEX(x,ROW(A138)),FIND(\"]\",INDEX(x,ROW(A138)))+1,31)))","v":""}]
[null,{"$f":"IF(ROW(A139)>COUNTA(x),\"\",HYPERLINK(\"#'\"&INDEX(x,ROW(A139))&\"'!A1\",MID(INDEX(x,ROW(A139)),FIND(\"]\",INDEX(x,ROW(A139)))+1,31)))","v":""}]
[null,{"$f":"IF(ROW(A140)>COUNTA(x),\"\",HYPERLINK(\"#'\"&INDEX(x,ROW(A140))&\"'!A1\",MID(INDEX(x,ROW(A140)),FIND(\"]\",INDEX(x,ROW(A140)))+1,31)))","v":""}]
[null,{"$f":"IF(ROW(A141)>COUNTA(x),\"\",HYPERLINK(\"#'\"&INDEX(x,ROW(A141))&\"'!A1\",MID(INDEX(x,ROW(A141)),FIND(\"]\",INDEX(x,ROW(A141)))+1,31)))","v":""}]
[null,{"$f":"IF(ROW(A142)>COUNTA(x),\"\",HYPERLINK(\"#'\"&INDEX(x,ROW(A142))&\"'!A1\",MID(INDEX(x,ROW(A142)),FIND(\"]\",INDEX(x,ROW(A142)))+1,31)))","v":""}]
[null,{"$f":"IF(ROW(A143)>COUNTA(x),\"\",HYPERLINK(\"#'\"&INDEX(x,ROW(A143))&\"'!A1\",MID(INDEX(x,ROW(A143)),FIND(\"]\",INDEX(x,ROW(A143)))+1,31)))","v":""}]
[null,{"$f":"IF(ROW(A144)>COUNTA(x),\"\",HYPERLINK(\"#'\"&INDEX(x,ROW(A144))&\"'!A1\",MID(INDEX(x,ROW(A144)),FIND(\"]\",INDEX(x,ROW(A144)))+1,31)))","v":""}]
[null,{"$f":"IF(ROW(A145)>COUNTA(x),\"\",HYPERLINK(\"#'\"&INDEX(x,ROW(A145))&\"'!A1\",MID(INDEX(x,ROW(A145)),FIND(\"]\",INDEX(x,ROW(A145)))+1,31)))","v":""}]
[null,{"$f":"IF(ROW(A146)>COUNTA(x),\"\",HYPERLINK(\"#'\"&INDEX(x,ROW(A146))&\"'!A1\",MID(INDEX(x,ROW(A146)),FIND(\"]\",INDEX(x,ROW(A146)))+1,31)))","v":""}]
[null,{"$f":"IF(ROW(A147)>COUNTA(x),\"\",HYPERLINK(\"#'\"&INDEX(x,ROW(A147))&\"'!A1\",MID(INDEX(x,ROW(A147)),FIND(\"]\",INDEX(x,ROW(A147)))+1,31)))","v":""}]
[null,{"$f":"IF(ROW(A148)>COUNTA(x),\"\",HYPERLINK(\"#'\"&INDEX(x,ROW(A148))&\"'!A1\",MID(INDEX(x,ROW(A148)),FIND(\"]\",INDEX(x,ROW(A148)))+1,31)))","v":""}]
[null,{"$f":"IF(ROW(A149)>COUNTA(x),\"\",HYPERLINK(\"#'\"&INDEX(x,ROW(A149))&\"'!A1\",MID(INDEX(x,ROW(A149)),FIND(\"]\",INDEX(x,ROW(A149)))+1,31)))","v":""}]
[null,{"$f":"IF(ROW(A150)>COUNTA(x),\"\",HYPERLINK(\"#'\"&INDEX(x,ROW(A150))&\"'!A1\",MID(INDEX(x,ROW(A150)),FIND(\"]\",INDEX(x,ROW(A150)))+1,31)))","v":""}]
[null,{"$f":"IF(ROW(A151)>COUNTA(x),\"\",HYPERLINK(\"#'\"&INDEX(x,ROW(A151))&\"'!A1\",MID(INDEX(x,ROW(A151)),FIND(\"]\",INDEX(x,ROW(A151)))+1,31)))","v":""}]
[null,{"$f":"IF(ROW(A152)>COUNTA(x),\"\",HYPERLINK(\"#'\"&INDEX(x,ROW(A152))&\"'!A1\",MID(INDEX(x,ROW(A152)),FIND(\"]\",INDEX(x,ROW(A152)))+1,31)))","v":""}]
[null,{"$f":"IF(ROW(A153)>COUNTA(x),\"\",HYPERLINK(\"#'\"&INDEX(x,ROW(A153))&\"'!A1\",MID(INDEX(x,ROW(A153)),FIND(\"]\",INDEX(x,ROW(A153)))+1,31)))","v":""}]
[null,{"$f":"IF(ROW(A154)>COUNTA(x),\"\",HYPERLINK(\"#'\"&INDEX(x,ROW(A154))&\"'!A1\",MID(INDEX(x,ROW(A154)),FIND(\"]\",INDEX(x,ROW(A154)))+1,31)))","v":""}]
[null,{"$f":"IF(ROW(A155)>COUNTA(x),\"\",HYPERLINK(\"#'\"&INDEX(x,ROW(A155))&\"'!A1\",MID(INDEX(x,ROW(A155)),FIND(\"]\",INDEX(x,ROW(A155)))+1,31)))","v":""}]
[null,{"$f":"IF(ROW(A156)>COUNTA(x),\"\",HYPERLINK(\"#'\"&INDEX(x,ROW(A156))&\"'!A1\",MID(INDEX(x,ROW(A156)),FIND(\"]\",INDEX(x,ROW(A156)))+1,31)))","v":""}]
[null,{"$f":"IF(ROW(A157)>COUNTA(x),\"\",HYPERLINK(\"#'\"&INDEX(x,ROW(A157))&\"'!A1\",MID(INDEX(x,ROW(A157)),FIND(\"]\",INDEX(x,ROW(A157)))+1,31)))","v":""}]
[null,{"$f":"IF(ROW(A158)>COUNTA(x),\"\",HYPERLINK(\"#'\"&INDEX(x,ROW(A158))&\"'!A1\",MID(INDEX(x,ROW(A158)),FIND(\"]\",INDEX(x,ROW(A158)))+1,31)))","v":""}]
[null,{"$f":"IF(ROW(A159)>COUNTA(x),\"\",HYPERLINK(\"#'\"&INDEX(x,ROW(A159))&\"'!A1\",MID(INDEX(x,ROW(A159)),FIND(\"]\",INDEX(x,ROW(A159)))+1,31)))","v":""}]
[null,{"$f":"IF(ROW(A160)>COUNTA(x),\"\",HYPERLINK(\"#'\"&INDEX(x,ROW(A160))&\"'!A1\",MID(INDEX(x,ROW(A160)),FIND(\"]\",INDEX(x,ROW(A160)))+1,31)))","v":""}]
[null,{"$f":"IF(ROW(A161)>COUNTA(x),\"\",HYPERLINK(\"#'\"&INDEX(x,ROW(A161))&\"'!A1\",MID(INDEX(x,ROW(A161)),FIND(\"]\",INDEX(x,ROW(A161)))+1,31)))","v":""}]
[null,{"$f":"IF(ROW(A162)>COUNTA(x),\"\",HYPERLINK(\"#'\"&INDEX(x,ROW(A162))&\"'!A1\",MID(INDEX(x,ROW(A162)),FIND(\"]\",INDEX(x,ROW(A162)))+1,31)))","v":""}]
[null,{"$f":"IF(ROW(A163)>COUNTA(x),\"\",HYPERLINK(\"#'\"&INDEX(x,ROW(A163))&\"'!A1\",MID(INDEX(x,ROW(A163)),FIND(\"]\",INDEX(x,ROW(A163)))+1,31)))","v":""}]
[null,{"$f":"IF(ROW(A164)>COUNTA(x),\"\",HYPERLINK(\"#'\"&INDEX(x,ROW(A164))&\"'!A1\",MID(INDEX(x,ROW(A164)),FIND(\"]\",INDEX(x,ROW(A164)))+1,31)))","v":""}]
[null,{"$f":"IF(ROW(A165)>COUNTA(x),\"\",HYPERLINK(\"#'\"&INDEX(x,ROW(A165))&\"'!A1\",MID(INDEX(x,ROW(A165)),FIND(\"]\",INDEX(x,ROW(A165)))+1,31)))","v":""}]
[null,{"$f":"IF(ROW(A166)>COUNTA(x),\"\",HYPERLINK(\"#'\"&INDEX(x,ROW(A166))&\"'!A1\",MID(INDEX(x,ROW(A166)),FIND(\"]\",INDEX(x,ROW(A166)))+1,31)))","v":""}]
[null,{"$f":"IF(ROW(A167)>COUNTA(x),\"\",HYPERLINK(\"#'\"&INDEX(x,ROW(A167))&\"'!A1\",MID(INDEX(x,ROW(A167)),FIND(\"]\",INDEX(x,ROW(A167)))+1,31)))","v":""}]
[null,{"$f":"IF(ROW(A168)>COUNTA(x),\"\",HYPERLINK(\"#'\"&INDEX(x,ROW(A168))&\"'!A1\",MID(INDEX(x,ROW(A168)),FIND(\"]\",INDEX(x,ROW(A168)))+1,31)))","v":""}]
[null,{"$f":"IF(ROW(A169)>COUNTA(x),\"\",HYPERLINK(\"#'\"&INDEX(x,ROW(A169))&\"'!A1\",MID(INDEX(x,ROW(A169)),FIND(\"]\",INDEX(x,ROW(A169)))+1,31)))","v":""}]
[null,{"$f":"IF(ROW(A170)>COUNTA(x),\"\",HYPERLINK(\"#'\"&INDEX(x,ROW(A170))&\"'!A1\",MID(INDEX(x,ROW(A170)),FIND(\"]\",INDEX(x,ROW(A170)))+1,31)))","v":""}]
[null,{"$f":"IF(ROW(A171)>COUNTA(x),\"\",HYPERLINK(\"#'\"&INDEX(x,ROW(A171))&\"'!A1\",MID(INDEX(x,ROW(A171)),FIND(\"]\",INDEX(x,ROW(A171)))+1,31)))","v":""}]
[null,{"$f":"IF(ROW(A172)>COUNTA(x),\"\",HYPERLINK(\"#'\"&INDEX(x,ROW(A172))&\"'!A1\",MID(INDEX(x,ROW(A172)),FIND(\"]\",INDEX(x,ROW(A172)))+1,31)))","v":""}]
[null,{"$f":"IF(ROW(A173)>COUNTA(x),\"\",HYPERLINK(\"#'\"&INDEX(x,ROW(A173))&\"'!A1\",MID(INDEX(x,ROW(A173)),FIND(\"]\",INDEX(x,ROW(A173)))+1,31)))","v":""}]
[null,{"$f":"IF(ROW(A174)>COUNTA(x),\"\",HYPERLINK(\"#'\"&INDEX(x,ROW(A174))&\"'!A1\",MID(INDEX(x,ROW(A174)),FIND(\"]\",INDEX(x,ROW(A174)))+1,31)))","v":""}]
[null,{"$f":"IF(ROW(A175)>COUNTA(x),\"\",HYPERLINK(\"#'\"&INDEX(x,ROW(A175))&\"'!A1\",MID(INDEX(x,ROW(A175)),FIND(\"]\",INDEX(x,ROW(A175)))+1,31)))","v":""}]
[null,{"$f":"IF(ROW(A176)>COUNTA(x),\"\",HYPERLINK(\"#'\"&INDEX(x,ROW(A176))&\"'!A1\",MID(INDEX(x,ROW(A176)),FIND(\"]\",INDEX(x,ROW(A176)))+1,31)))","v":""}]
[null,{"$f":"IF(ROW(A177)>COUNTA(x),\"\",HYPERLINK(\"#'\"&INDEX(x,ROW(A177))&\"'!A1\",MID(INDEX(x,ROW(A177)),FIND(\"]\",INDEX(x,ROW(A177)))+1,31)))","v":""}]
[null,{"$f":"IF(ROW(A178)>COUNTA(x),\"\",HYPERLINK(\"#'\"&INDEX(x,ROW(A178))&\"'!A1\",MID(INDEX(x,ROW(A178)),FIND(\"]\",INDEX(x,ROW(A178)))+1,31)))","v":""}]
[null,{"$f":"IF(ROW(A179)>COUNTA(x),\"\",HYPERLINK(\"#'\"&INDEX(x,ROW(A179))&\"'!A1\",MID(INDEX(x,ROW(A179)),FIND(\"]\",INDEX(x,ROW(A179)))+1,31)))","v":""}]
[null,{"$f":"IF(ROW(A180)>COUNTA(x),\"\",HYPERLINK(\"#'\"&INDEX(x,ROW(A180))&\"'!A1\",MID(INDEX(x,ROW(A180)),FIND(\"]\",INDEX(x,ROW(A180)))+1,31)))","v":""}]
[null,{"$f":"IF(ROW(A181)>COUNTA(x),\"\",HYPERLINK(\"#'\"&INDEX(x,ROW(A181))&\"'!A1\",MID(INDEX(x,ROW(A181)),FIND(\"]\",INDEX(x,ROW(A181)))+1,31)))","v":""}]
[null,{"$f":"IF(ROW(A182)>COUNTA(x),\"\",HYPERLINK(\"#'\"&INDEX(x,ROW(A182))&\"'!A1\",MID(INDEX(x,ROW(A182)),FIND(\"]\",INDEX(x,ROW(A182)))+1,31)))","v":""}]
[null,{"$f":"IF(ROW(A183)>COUNTA(x),\"\",HYPERLINK(\"#'\"&INDEX(x,ROW(A183))&\"'!A1\",MID(INDEX(x,ROW(A183)),FIND(\"]\",INDEX(x,ROW(A183)))+1,31)))","v":""}]
[null,{"$f":"IF(ROW(A184)>COUNTA(x),\"\",HYPERLINK(\"#'\"&INDEX(x,ROW(A184))&\"'!A1\",MID(INDEX(x,ROW(A184)),FIND(\"]\",INDEX(x,ROW(A184)))+1,31)))","v":""}]
[null,{"$f":"IF(ROW(A185)>COUNTA(x),\"\",HYPERLINK(\"#'\"&INDEX(x,ROW(A185))&\"'!A1\",MID(INDEX(x,ROW(A185)),FIND(\"]\",INDEX(x,ROW(A185)))+1,31)))","v":""}]
[null,{"$f":"IF(ROW(A186)>COUNTA(x),\"\",HYPERLINK(\"#'\"&INDEX(x,ROW(A186))&\"'!A1\",MID(INDEX(x,ROW(A186)),FIND(\"]\",INDEX(x,ROW(A186)))+1,31)))","v":""}]
[null,{"$f":"IF(ROW(A187)>COUNTA(x),\"\",HYPERLINK(\"#'\"&INDEX(x,ROW(A187))&\"'!A1\",MID(INDEX(x,ROW(A187)),FIND(\"]\",INDEX(x,ROW(A187)))+1,31)))","v":""}]
[null,{"$f":"IF(ROW(A188)>COUNTA(x),\"\",HYPERLINK(\"#'\"&INDEX(x,ROW(A188))&\"'!A1\",MID(INDEX(x,ROW(A188)),FIND(\"]\",INDEX(x,ROW(A188)))+1,31)))","v":""}]
[null,{"$f":"IF(ROW(A189)>COUNTA(x),\"\",HYPERLINK(\"#'\"&INDEX(x,ROW(A189))&\"'!A1\",MID(INDEX(x,ROW(A189)),FIND(\"]\",INDEX(x,ROW(A189)))+1,31)))","v":""}]
[null,{"$f":"IF(ROW(A190)>COUNTA(x),\"\",HYPERLINK(\"#'\"&INDEX(x,ROW(A190))&\"'!A1\",MID(INDEX(x,ROW(A190)),FIND(\"]\",INDEX(x,ROW(A190)))+1,31)))","v":""}]
[null,{"$f":"IF(ROW(A191)>COUNTA(x),\"\",HYPERLINK(\"#'\"&INDEX(x,ROW(A191))&\"'!A1\",MID(INDEX(x,ROW(A191)),FIND(\"]\",INDEX(x,ROW(A191)))+1,31)))","v":""}]
[null,{"$f":"IF(ROW(A192)>COUNTA(x),\"\",HYPERLINK(\"#'\"&INDEX(x,ROW(A192))&\"'!A1\",MID(INDEX(x,ROW(A192)),FIND(\"]\",INDEX(x,ROW(A192)))+1,31)))","v":""}]
[null,{"$f":"IF(ROW(A193)>COUNTA(x),\"\",HYPERLINK(\"#'\"&INDEX(x,ROW(A193))&\"'!A1\",MID(INDEX(x,ROW(A193)),FIND(\"]\",INDEX(x,ROW(A193)))+1,31)))","v":""}]
[null,{"$f":"IF(ROW(A194)>COUNTA(x),\"\",HYPERLINK(\"#'\"&INDEX(x,ROW(A194))&\"'!A1\",MID(INDEX(x,ROW(A194)),FIND(\"]\",INDEX(x,ROW(A194)))+1,31)))","v":""}]
[null,{"$f":"IF(ROW(A195)>COUNTA(x),\"\",HYPERLINK(\"#'\"&INDEX(x,ROW(A195))&\"'!A1\",MID(INDEX(x,ROW(A195)),FIND(\"]\",INDEX(x,ROW(A195)))+1,31)))","v":""}]
[null,{"$f":"IF(ROW(A196)>COUNTA(x),\"\",HYPERLINK(\"#'\"&INDEX(x,ROW(A196))&\"'!A1\",MID(INDEX(x,ROW(A196)),FIND(\"]\",INDEX(x,ROW(A196)))+1,31)))","v":""}]
[null,{"$f":"IF(ROW(A197)>COUNTA(x),\"\",HYPERLINK(\"#'\"&INDEX(x,ROW(A197))&\"'!A1\",MID(INDEX(x,ROW(A197)),FIND(\"]\",INDEX(x,ROW(A197)))+1,31)))","v":""}]
[null,{"$f":"IF(ROW(A198)>COUNTA(x),\"\",HYPERLINK(\"#'\"&INDEX(x,ROW(A198))&\"'!A1\",MID(INDEX(x,ROW(A198)),FIND(\"]\",INDEX(x,ROW(A198)))+1,31)))","v":""}]
[null,{"$f":"IF(ROW(A199)>COUNTA(x),\"\",HYPERLINK(\"#'\"&INDEX(x,ROW(A199))&\"'!A1\",MID(INDEX(x,ROW(A199)),FIND(\"]\",INDEX(x,ROW(A199)))+1,31)))","v":""}]
[null,{"$f":"IF(ROW(A200)>COUNTA(x),\"\",HYPERLINK(\"#'\"&INDEX(x,ROW(A200))&\"'!A1\",MID(INDEX(x,ROW(A200)),FIND(\"]\",INDEX(x,ROW(A200)))+1,31)))","v":""}]
[null,{"$f":"IF(ROW(A201)>COUNTA(x),\"\",HYPERLINK(\"#'\"&INDEX(x,ROW(A201))&\"'!A1\",MID(INDEX(x,ROW(A201)),FIND(\"]\",INDEX(x,ROW(A201)))+1,31)))","v":""}]
[null,{"$f":"IF(ROW(A202)>COUNTA(x),\"\",HYPERLINK(\"#'\"&INDEX(x,ROW(A202))&\"'!A1\",MID(INDEX(x,ROW(A202)),FIND(\"]\",INDEX(x,ROW(A202)))+1,31)))","v":""}]
[null,{"$f":"IF(ROW(A203)>COUNTA(x),\"\",HYPERLINK(\"#'\"&INDEX(x,ROW(A203))&\"'!A1\",MID(INDEX(x,ROW(A203)),FIND(\"]\",INDEX(x,ROW(A203)))+1,31)))","v":""}]
[null,{"$f":"IF(ROW(A204)>COUNTA(x),\"\",HYPERLINK(\"#'\"&INDEX(x,ROW(A204))&\"'!A1\",MID(INDEX(x,ROW(A204)),FIND(\"]\",INDEX(x,ROW(A204)))+1,31)))","v":""}]
[null,{"$f":"IF(ROW(A205)>COUNTA(x),\"\",HYPERLINK(\"#'\"&INDEX(x,ROW(A205))&\"'!A1\",MID(INDEX(x,ROW(A205)),FIND(\"]\",INDEX(x,ROW(A205)))+1,31)))","v":""}]
[null,{"$f":"IF(ROW(A206)>COUNTA(x),\"\",HYPERLINK(\"#'\"&INDEX(x,ROW(A206))&\"'!A1\",MID(INDEX(x,ROW(A206)),FIND(\"]\",INDEX(x,ROW(A206)))+1,31)))","v":""}]
[null,{"$f":"IF(ROW(A207)>COUNTA(x),\"\",HYPERLINK(\"#'\"&INDEX(x,ROW(A207))&\"'!A1\",MID(INDEX(x,ROW(A207)),FIND(\"]\",INDEX(x,ROW(A207)))+1,31)))","v":""}]
[null,{"$f":"IF(ROW(A208)>COUNTA(x),\"\",HYPERLINK(\"#'\"&INDEX(x,ROW(A208))&\"'!A1\",MID(INDEX(x,ROW(A208)),FIND(\"]\",INDEX(x,ROW(A208)))+1,31)))","v":""}]
[null,{"$f":"IF(ROW(A209)>COUNTA(x),\"\",HYPERLINK(\"#'\"&INDEX(x,ROW(A209))&\"'!A1\",MID(INDEX(x,ROW(A209)),FIND(\"]\",INDEX(x,ROW(A209)))+1,31)))","v":""}]
[null,{"$f":"IF(ROW(A210)>COUNTA(x),\"\",HYPERLINK(\"#'\"&INDEX(x,ROW(A210))&\"'!A1\",MID(INDEX(x,ROW(A210)),FIND(\"]\",INDEX(x,ROW(A210)))+1,31)))","v":""}]
[null,{"$f":"IF(ROW(A211)>COUNTA(x),\"\",HYPERLINK(\"#'\"&INDEX(x,ROW(A211))&\"'!A1\",MID(INDEX(x,ROW(A211)),FIND(\"]\",INDEX(x,ROW(A211)))+1,31)))","v":""}]
[null,{"$f":"IF(ROW(A212)>COUNTA(x),\"\",HYPERLINK(\"#'\"&INDEX(x,ROW(A212))&\"'!A1\",MID(INDEX(x,ROW(A212)),FIND(\"]\",INDEX(x,ROW(A212)))+1,31)))","v":""}]
[null,{"$f":"IF(ROW(A213)>COUNTA(x),\"\",HYPERLINK(\"#'\"&INDEX(x,ROW(A213))&\"'!A1\",MID(INDEX(x,ROW(A213)),FIND(\"]\",INDEX(x,ROW(A213)))+1,31)))","v":""}]
[null,{"$f":"IF(ROW(A214)>COUNTA(x),\"\",HYPERLINK(\"#'\"&INDEX(x,ROW(A214))&\"'!A1\",MID(INDEX(x,ROW(A214)),FIND(\"]\",INDEX(x,ROW(A214)))+1,31)))","v":""}]
[null,{"$f":"IF(ROW(A215)>COUNTA(x),\"\",HYPERLINK(\"#'\"&INDEX(x,ROW(A215))&\"'!A1\",MID(INDEX(x,ROW(A215)),FIND(\"]\",INDEX(x,ROW(A215)))+1,31)))","v":""}]
[null,{"$f":"IF(ROW(A216)>COUNTA(x),\"\",HYPERLINK(\"#'\"&INDEX(x,ROW(A216))&\"'!A1\",MID(INDEX(x,ROW(A216)),FIND(\"]\",INDEX(x,ROW(A216)))+1,31)))","v":""}]
[null,{"$f":"IF(ROW(A217)>COUNTA(x),\"\",HYPERLINK(\"#'\"&INDEX(x,ROW(A217))&\"'!A1\",MID(INDEX(x,ROW(A217)),FIND(\"]\",INDEX(x,ROW(A217)))+1,31)))","v":""}]
[null,{"$f":"IF(ROW(A218)>COUNTA(x),\"\",HYPERLINK(\"#'\"&INDEX(x,ROW(A218))&\"'!A1\",MID(INDEX(x,ROW(A218)),FIND(\"]\",INDEX(x,ROW(A218)))+1,31)))","v":""}]
[null,{"$f":"IF(ROW(A219)>COUNTA(x),\"\",HYPERLINK(\"#'\"&INDEX(x,ROW(A219))&\"'!A1\",MID(INDEX(x,ROW(A219)),FIND(\"]\",INDEX(x,ROW(A219)))+1,31)))","v":""}]
[null,{"$f":"IF(ROW(A220)>COUNTA(x),\"\",HYPERLINK(\"#'\"&INDEX(x,ROW(A220))&\"'!A1\",MID(INDEX(x,ROW(A220)),FIND(\"]\",INDEX(x,ROW(A220)))+1,31)))","v":""}]
[null,{"$f":"IF(ROW(A221)>COUNTA(x),\"\",HYPERLINK(\"#'\"&INDEX(x,ROW(A221))&\"'!A1\",MID(INDEX(x,ROW(A221)),FIND(\"]\",INDEX(x,ROW(A221)))+1,31)))","v":""}]
[null,{"$f":"IF(ROW(A222)>COUNTA(x),\"\",HYPERLINK(\"#'\"&INDEX(x,ROW(A222))&\"'!A1\",MID(INDEX(x,ROW(A222)),FIND(\"]\",INDEX(x,ROW(A222)))+1,31)))","v":""}]
[null,{"$f":"IF(ROW(A223)>COUNTA(x),\"\",HYPERLINK(\"#'\"&INDEX(x,ROW(A223))&\"'!A1\",MID(INDEX(x,ROW(A223)),FIND(\"]\",INDEX(x,ROW(A223)))+1,31)))","v":""}]
[null,{"$f":"IF(ROW(A224)>COUNTA(x),\"\",HYPERLINK(\"#'\"&INDEX(x,ROW(A224))&\"'!A1\",MID(INDEX(x,ROW(A224)),FIND(\"]\",INDEX(x,ROW(A224)))+1,31)))","v":""}]
[null,{"$f":"IF(ROW(A225)>COUNTA(x),\"\",HYPERLINK(\"#'\"&INDEX(x,ROW(A225))&\"'!A1\",MID(INDEX(x,ROW(A225)),FIND(\"]\",INDEX(x,ROW(A225)))+1,31)))","v":""}]
[null,{"$f":"IF(ROW(A226)>COUNTA(x),\"\",HYPERLINK(\"#'\"&INDEX(x,ROW(A226))&\"'!A1\",MID(INDEX(x,ROW(A226)),FIND(\"]\",INDEX(x,ROW(A226)))+1,31)))","v":""}]
[null,{"$f":"IF(ROW(A227)>COUNTA(x),\"\",HYPERLINK(\"#'\"&INDEX(x,ROW(A227))&\"'!A1\",MID(INDEX(x,ROW(A227)),FIND(\"]\",INDEX(x,ROW(A227)))+1,31)))","v":""}]
[null,{"$f":"IF(ROW(A228)>COUNTA(x),\"\",HYPERLINK(\"#'\"&INDEX(x,ROW(A228))&\"'!A1\",MID(INDEX(x,ROW(A228)),FIND(\"]\",INDEX(x,ROW(A228)))+1,31)))","v":""}]
[null,{"$f":"IF(ROW(A229)>COUNTA(x),\"\",HYPERLINK(\"#'\"&INDEX(x,ROW(A229))&\"'!A1\",MID(INDEX(x,ROW(A229)),FIND(\"]\",INDEX(x,ROW(A229)))+1,31)))","v":""}]
[null,{"$f":"IF(ROW(A230)>COUNTA(x),\"\",HYPERLINK(\"#'\"&INDEX(x,ROW(A230))&\"'!A1\",MID(INDEX(x,ROW(A230)),FIND(\"]\",INDEX(x,ROW(A230)))+1,31)))","v":""}]
[null,{"$f":"IF(ROW(A231)>COUNTA(x),\"\",HYPERLINK(\"#'\"&INDEX(x,ROW(A231))&\"'!A1\",MID(INDEX(x,ROW(A231)),FIND(\"]\",INDEX(x,ROW(A231)))+1,31)))","v":""}]
[null,{"$f":"IF(ROW(A232)>COUNTA(x),\"\",HYPERLINK(\"#'\"&INDEX(x,ROW(A232))&\"'!A1\",MID(INDEX(x,ROW(A232)),FIND(\"]\",INDEX(x,ROW(A232)))+1,31)))","v":""}]
[null,{"$f":"IF(ROW(A233)>COUNTA(x),\"\",HYPERLINK(\"#'\"&INDEX(x,ROW(A233))&\"'!A1\",MID(INDEX(x,ROW(A233)),FIND(\"]\",INDEX(x,ROW(A233)))+1,31)))","v":""}]
[null,{"$f":"IF(ROW(A234)>COUNTA(x),\"\",HYPERLINK(\"#'\"&INDEX(x,ROW(A234))&\"'!A1\",MID(INDEX(x,ROW(A234)),FIND(\"]\",INDEX(x,ROW(A234)))+1,31)))","v":""}]
[null,{"$f":"IF(ROW(A235)>COUNTA(x),\"\",HYPERLINK(\"#'\"&INDEX(x,ROW(A235))&\"'!A1\",MID(INDEX(x,ROW(A235)),FIND(\"]\",INDEX(x,ROW(A235)))+1,31)))","v":""}]
[null,{"$f":"IF(ROW(A236)>COUNTA(x),\"\",HYPERLINK(\"#'\"&INDEX(x,ROW(A236))&\"'!A1\",MID(INDEX(x,ROW(A236)),FIND(\"]\",INDEX(x,ROW(A236)))+1,31)))","v":""}]
[null,{"$f":"IF(ROW(A237)>COUNTA(x),\"\",HYPERLINK(\"#'\"&INDEX(x,ROW(A237))&\"'!A1\",MID(INDEX(x,ROW(A237)),FIND(\"]\",INDEX(x,ROW(A237)))+1,31)))","v":""}]
[null,{"$f":"IF(ROW(A238)>COUNTA(x),\"\",HYPERLINK(\"#'\"&INDEX(x,ROW(A238))&\"'!A1\",MID(INDEX(x,ROW(A238)),FIND(\"]\",INDEX(x,ROW(A238)))+1,31)))","v":""}]
[null,{"$f":"IF(ROW(A239)>COUNTA(x),\"\",HYPERLINK(\"#'\"&INDEX(x,ROW(A239))&\"'!A1\",MID(INDEX(x,ROW(A239)),FIND(\"]\",INDEX(x,ROW(A239)))+1,31)))","v":""}]
[null,{"$f":"IF(ROW(A240)>COUNTA(x),\"\",HYPERLINK(\"#'\"&INDEX(x,ROW(A240))&\"'!A1\",MID(INDEX(x,ROW(A240)),FIND(\"]\",INDEX(x,ROW(A240)))+1,31)))","v":""}]
[null,{"$f":"IF(ROW(A241)>COUNTA(x),\"\",HYPERLINK(\"#'\"&INDEX(x,ROW(A241))&\"'!A1\",MID(INDEX(x,ROW(A241)),FIND(\"]\",INDEX(x,ROW(A241)))+1,31)))","v":""}]
[null,{"$f":"IF(ROW(A242)>COUNTA(x),\"\",HYPERLINK(\"#'\"&INDEX(x,ROW(A242))&\"'!A1\",MID(INDEX(x,ROW(A242)),FIND(\"]\",INDEX(x,ROW(A242)))+1,31)))","v":""}]
[null,{"$f":"IF(ROW(A243)>COUNTA(x),\"\",HYPERLINK(\"#'\"&INDEX(x,ROW(A243))&\"'!A1\",MID(INDEX(x,ROW(A243)),FIND(\"]\",INDEX(x,ROW(A243)))+1,31)))","v":""}]
[null,{"$f":"IF(ROW(A244)>COUNTA(x),\"\",HYPERLINK(\"#'\"&INDEX(x,ROW(A244))&\"'!A1\",MID(INDEX(x,ROW(A244)),FIND(\"]\",INDEX(x,ROW(A244)))+1,31)))","v":""}]
[null,{"$f":"IF(ROW(A245)>COUNTA(x),\"\",HYPERLINK(\"#'\"&INDEX(x,ROW(A245))&\"'!A1\",MID(INDEX(x,ROW(A245)),FIND(\"]\",INDEX(x,ROW(A245)))+1,31)))","v":""}]
[null,{"$f":"IF(ROW(A246)>COUNTA(x),\"\",HYPERLINK(\"#'\"&INDEX(x,ROW(A246))&\"'!A1\",MID(INDEX(x,ROW(A246)),FIND(\"]\",INDEX(x,ROW(A246)))+1,31)))","v":""}]
[null,{"$f":"IF(ROW(A247)>COUNTA(x),\"\",HYPERLINK(\"#'\"&INDEX(x,ROW(A247))&\"'!A1\",MID(INDEX(x,ROW(A247)),FIND(\"]\",INDEX(x,ROW(A247)))+1,31)))","v":""}]
[null,{"$f":"IF(ROW(A248)>COUNTA(x),\"\",HYPERLINK(\"#'\"&INDEX(x,ROW(A248))&\"'!A1\",MID(INDEX(x,ROW(A248)),FIND(\"]\",INDEX(x,ROW(A248)))+1,31)))","v":""}]
[null,{"$f":"IF(ROW(A249)>COUNTA(x),\"\",HYPERLINK(\"#'\"&INDEX(x,ROW(A249))&\"'!A1\",MID(INDEX(x,ROW(A249)),FIND(\"]\",INDEX(x,ROW(A249)))+1,31)))","v":""}]
[null,{"$f":"IF(ROW(A250)>COUNTA(x),\"\",HYPERLINK(\"#'\"&INDEX(x,ROW(A250))&\"'!A1\",MID(INDEX(x,ROW(A250)),FIND(\"]\",INDEX(x,ROW(A250)))+1,31)))","v":""}]
[null,{"$f":"IF(ROW(A251)>COUNTA(x),\"\",HYPERLINK(\"#'\"&INDEX(x,ROW(A251))&\"'!A1\",MID(INDEX(x,ROW(A251)),FIND(\"]\",INDEX(x,ROW(A251)))+1,31)))","v":""}]
[null,{"$f":"IF(ROW(A252)>COUNTA(x),\"\",HYPERLINK(\"#'\"&INDEX(x,ROW(A252))&\"'!A1\",MID(INDEX(x,ROW(A252)),FIND(\"]\",INDEX(x,ROW(A252)))+1,31)))","v":""}]
[null,{"$f":"IF(ROW(A253)>COUNTA(x),\"\",HYPERLINK(\"#'\"&INDEX(x,ROW(A253))&\"'!A1\",MID(INDEX(x,ROW(A253)),FIND(\"]\",INDEX(x,ROW(A253)))+1,31)))","v":""}]
[null,{"$f":"IF(ROW(A254)>COUNTA(x),\"\",HYPERLINK(\"#'\"&INDEX(x,ROW(A254))&\"'!A1\",MID(INDEX(x,ROW(A254)),FIND(\"]\",INDEX(x,ROW(A254)))+1,31)))","v":""}]
[null,{"$f":"IF(ROW(A255)>COUNTA(x),\"\",HYPERLINK(\"#'\"&INDEX(x,ROW(A255))&\"'!A1\",MID(INDEX(x,ROW(A255)),FIND(\"]\",INDEX(x,ROW(A255)))+1,31)))","v":""}]
[null,{"$f":"IF(ROW(A256)>COUNTA(x),\"\",HYPERLINK(\"#'\"&INDEX(x,ROW(A256))&\"'!A1\",MID(INDEX(x,ROW(A256)),FIND(\"]\",INDEX(x,ROW(A256)))+1,31)))","v":""}]
[null,{"$f":"IF(ROW(A257)>COUNTA(x),\"\",HYPERLINK(\"#'\"&INDEX(x,ROW(A257))&\"'!A1\",MID(INDEX(x,ROW(A257)),FIND(\"]\",INDEX(x,ROW(A257)))+1,31)))","v":""}]
[null,{"$f":"IF(ROW(A258)>COUNTA(x),\"\",HYPERLINK(\"#'\"&INDEX(x,ROW(A258))&\"'!A1\",MID(INDEX(x,ROW(A258)),FIND(\"]\",INDEX(x,ROW(A258)))+1,31)))","v":""}]
[null,{"$f":"IF(ROW(A259)>COUNTA(x),\"\",HYPERLINK(\"#'\"&INDEX(x,ROW(A259))&\"'!A1\",MID(INDEX(x,ROW(A259)),FIND(\"]\",INDEX(x,ROW(A259)))+1,31)))","v":""}]
[null,{"$f":"IF(ROW(A260)>COUNTA(x),\"\",HYPERLINK(\"#'\"&INDEX(x,ROW(A260))&\"'!A1\",MID(INDEX(x,ROW(A260)),FIND(\"]\",INDEX(x,ROW(A260)))+1,31)))","v":""}]
[null,{"$f":"IF(ROW(A261)>COUNTA(x),\"\",HYPERLINK(\"#'\"&INDEX(x,ROW(A261))&\"'!A1\",MID(INDEX(x,ROW(A261)),FIND(\"]\",INDEX(x,ROW(A261)))+1,31)))","v":""}]
[null,{"$f":"IF(ROW(A262)>COUNTA(x),\"\",HYPERLINK(\"#'\"&INDEX(x,ROW(A262))&\"'!A1\",MID(INDEX(x,ROW(A262)),FIND(\"]\",INDEX(x,ROW(A262)))+1,31)))","v":""}]
[null,{"$f":"IF(ROW(A263)>COUNTA(x),\"\",HYPERLINK(\"#'\"&INDEX(x,ROW(A263))&\"'!A1\",MID(INDEX(x,ROW(A263)),FIND(\"]\",INDEX(x,ROW(A263)))+1,31)))","v":""}]
[null,{"$f":"IF(ROW(A264)>COUNTA(x),\"\",HYPERLINK(\"#'\"&INDEX(x,ROW(A264))&\"'!A1\",MID(INDEX(x,ROW(A264)),FIND(\"]\",INDEX(x,ROW(A264)))+1,31)))","v":""}]
[null,{"$f":"IF(ROW(A265)>COUNTA(x),\"\",HYPERLINK(\"#'\"&INDEX(x,ROW(A265))&\"'!A1\",MID(INDEX(x,ROW(A265)),FIND(\"]\",INDEX(x,ROW(A265)))+1,31)))","v":""}]
[null,{"$f":"IF(ROW(A266)>COUNTA(x),\"\",HYPERLINK(\"#'\"&INDEX(x,ROW(A266))&\"'!A1\",MID(INDEX(x,ROW(A266)),FIND(\"]\",INDEX(x,ROW(A266)))+1,31)))","v":""}]
[null,{"$f":"IF(ROW(A267)>COUNTA(x),\"\",HYPERLINK(\"#'\"&INDEX(x,ROW(A267))&\"'!A1\",MID(INDEX(x,ROW(A267)),FIND(\"]\",INDEX(x,ROW(A267)))+1,31)))","v":""}]
[null,{"$f":"IF(ROW(A268)>COUNTA(x),\"\",HYPERLINK(\"#'\"&INDEX(x,ROW(A268))&\"'!A1\",MID(INDEX(x,ROW(A268)),FIND(\"]\",INDEX(x,ROW(A268)))+1,31)))","v":""}]
[null,{"$f":"IF(ROW(A269)>COUNTA(x),\"\",HYPERLINK(\"#'\"&INDEX(x,ROW(A269))&\"'!A1\",MID(INDEX(x,ROW(A269)),FIND(\"]\",INDEX(x,ROW(A269)))+1,31)))","v":""}]
[null,{"$f":"IF(ROW(A270)>COUNTA(x),\"\",HYPERLINK(\"#'\"&INDEX(x,ROW(A270))&\"'!A1\",MID(INDEX(x,ROW(A270)),FIND(\"]\",INDEX(x,ROW(A270)))+1,31)))","v":""}]
[null,{"$f":"IF(ROW(A271)>COUNTA(x),\"\",HYPERLINK(\"#'\"&INDEX(x,ROW(A271))&\"'!A1\",MID(INDEX(x,ROW(A271)),FIND(\"]\",INDEX(x,ROW(A271)))+1,31)))","v":""}]
[null,{"$f":"IF(ROW(A272)>COUNTA(x),\"\",HYPERLINK(\"#'\"&INDEX(x,ROW(A272))&\"'!A1\",MID(INDEX(x,ROW(A272)),FIND(\"]\",INDEX(x,ROW(A272)))+1,31)))","v":""}]
[null,{"$f":"IF(ROW(A273)>COUNTA(x),\"\",HYPERLINK(\"#'\"&INDEX(x,ROW(A273))&\"'!A1\",MID(INDEX(x,ROW(A273)),FIND(\"]\",INDEX(x,ROW(A273)))+1,31)))","v":""}]
[null,{"$f":"IF(ROW(A274)>COUNTA(x),\"\",HYPERLINK(\"#'\"&INDEX(x,ROW(A274))&\"'!A1\",MID(INDEX(x,ROW(A274)),FIND(\"]\",INDEX(x,ROW(A274)))+1,31)))","v":""}]
[null,{"$f":"IF(ROW(A275)>COUNTA(x),\"\",HYPERLINK(\"#'\"&INDEX(x,ROW(A275))&\"'!A1\",MID(INDEX(x,ROW(A275)),FIND(\"]\",INDEX(x,ROW(A275)))+1,31)))","v":""}]
[null,{"$f":"IF(ROW(A276)>COUNTA(x),\"\",HYPERLINK(\"#'\"&INDEX(x,ROW(A276))&\"'!A1\",MID(INDEX(x,ROW(A276)),FIND(\"]\",INDEX(x,ROW(A276)))+1,31)))","v":""}]
[null,{"$f":"IF(ROW(A277)>COUNTA(x),\"\",HYPERLINK(\"#'\"&INDEX(x,ROW(A277))&\"'!A1\",MID(INDEX(x,ROW(A277)),FIND(\"]\",INDEX(x,ROW(A277)))+1,31)))","v":""}]
[null,{"$f":"IF(ROW(A278)>COUNTA(x),\"\",HYPERLINK(\"#'\"&INDEX(x,ROW(A278))&\"'!A1\",MID(INDEX(x,ROW(A278)),FIND(\"]\",INDEX(x,ROW(A278)))+1,31)))","v":""}]
[null,{"$f":"IF(ROW(A279)>COUNTA(x),\"\",HYPERLINK(\"#'\"&INDEX(x,ROW(A279))&\"'!A1\",MID(INDEX(x,ROW(A279)),FIND(\"]\",INDEX(x,ROW(A279)))+1,31)))","v":""}]
[null,{"$f":"IF(ROW(A280)>COUNTA(x),\"\",HYPERLINK(\"#'\"&INDEX(x,ROW(A280))&\"'!A1\",MID(INDEX(x,ROW(A280)),FIND(\"]\",INDEX(x,ROW(A280)))+1,31)))","v":""}]
[null,{"$f":"IF(ROW(A281)>COUNTA(x),\"\",HYPERLINK(\"#'\"&INDEX(x,ROW(A281))&\"'!A1\",MID(INDEX(x,ROW(A281)),FIND(\"]\",INDEX(x,ROW(A281)))+1,31)))","v":""}]
[null,{"$f":"IF(ROW(A282)>COUNTA(x),\"\",HYPERLINK(\"#'\"&INDEX(x,ROW(A282))&\"'!A1\",MID(INDEX(x,ROW(A282)),FIND(\"]\",INDEX(x,ROW(A282)))+1,31)))","v":""}]
[null,{"$f":"IF(ROW(A283)>COUNTA(x),\"\",HYPERLINK(\"#'\"&INDEX(x,ROW(A283))&\"'!A1\",MID(INDEX(x,ROW(A283)),FIND(\"]\",INDEX(x,ROW(A283)))+1,31)))","v":""}]
[null,{"$f":"IF(ROW(A284)>COUNTA(x),\"\",HYPERLINK(\"#'\"&INDEX(x,ROW(A284))&\"'!A1\",MID(INDEX(x,ROW(A284)),FIND(\"]\",INDEX(x,ROW(A284)))+1,31)))","v":""}]
[null,{"$f":"IF(ROW(A285)>COUNTA(x),\"\",HYPERLINK(\"#'\"&INDEX(x,ROW(A285))&\"'!A1\",MID(INDEX(x,ROW(A285)),FIND(\"]\",INDEX(x,ROW(A285)))+1,31)))","v":""}]
[null,{"$f":"IF(ROW(A286)>COUNTA(x),\"\",HYPERLINK(\"#'\"&INDEX(x,ROW(A286))&\"'!A1\",MID(INDEX(x,ROW(A286)),FIND(\"]\",INDEX(x,ROW(A286)))+1,31)))","v":""}]
[null,{"$f":"IF(ROW(A287)>COUNTA(x),\"\",HYPERLINK(\"#'\"&INDEX(x,ROW(A287))&\"'!A1\",MID(INDEX(x,ROW(A287)),FIND(\"]\",INDEX(x,ROW(A287)))+1,31)))","v":""}]
[null,{"$f":"IF(ROW(A288)>COUNTA(x),\"\",HYPERLINK(\"#'\"&INDEX(x,ROW(A288))&\"'!A1\",MID(INDEX(x,ROW(A288)),FIND(\"]\",INDEX(x,ROW(A288)))+1,31)))","v":""}]
[null,{"$f":"IF(ROW(A289)>COUNTA(x),\"\",HYPERLINK(\"#'\"&INDEX(x,ROW(A289))&\"'!A1\",MID(INDEX(x,ROW(A289)),FIND(\"]\",INDEX(x,ROW(A289)))+1,31)))","v":""}]
[null,{"$f":"IF(ROW(A290)>COUNTA(x),\"\",HYPERLINK(\"#'\"&INDEX(x,ROW(A290))&\"'!A1\",MID(INDEX(x,ROW(A290)),FIND(\"]\",INDEX(x,ROW(A290)))+1,31)))","v":""}]
[null,{"$f":"IF(ROW(A291)>COUNTA(x),\"\",HYPERLINK(\"#'\"&INDEX(x,ROW(A291))&\"'!A1\",MID(INDEX(x,ROW(A291)),FIND(\"]\",INDEX(x,ROW(A291)))+1,31)))","v":""}]
[null,{"$f":"IF(ROW(A292)>COUNTA(x),\"\",HYPERLINK(\"#'\"&INDEX(x,ROW(A292))&\"'!A1\",MID(INDEX(x,ROW(A292)),FIND(\"]\",INDEX(x,ROW(A292)))+1,31)))","v":""}]
[null,{"$f":"IF(ROW(A293)>COUNTA(x),\"\",HYPERLINK(\"#'\"&INDEX(x,ROW(A293))&\"'!A1\",MID(INDEX(x,ROW(A293)),FIND(\"]\",INDEX(x,ROW(A293)))+1,31)))","v":""}]
[null,{"$f":"IF(ROW(A294)>COUNTA(x),\"\",HYPERLINK(\"#'\"&INDEX(x,ROW(A294))&\"'!A1\",MID(INDEX(x,ROW(A294)),FIND(\"]\",INDEX(x,ROW(A294)))+1,31)))","v":""}]
[null,{"$f":"IF(ROW(A295)>COUNTA(x),\"\",HYPERLINK(\"#'\"&INDEX(x,ROW(A295))&\"'!A1\",MID(INDEX(x,ROW(A295)),FIND(\"]\",INDEX(x,ROW(A295)))+1,31)))","v":""}]
[null,{"$f":"IF(ROW(A296)>COUNTA(x),\"\",HYPERLINK(\"#'\"&INDEX(x,ROW(A296))&\"'!A1\",MID(INDEX(x,ROW(A296)),FIND(\"]\",INDEX(x,ROW(A296)))+1,31)))","v":""}]
[null,{"$f":"IF(ROW(A297)>COUNTA(x),\"\",HYPERLINK(\"#'\"&INDEX(x,ROW(A297))&\"'!A1\",MID(INDEX(x,ROW(A297)),FIND(\"]\",INDEX(x,ROW(A297)))+1,31)))","v":""}]
[null,{"$f":"IF(ROW(A298)>COUNTA(x),\"\",HYPERLINK(\"#'\"&INDEX(x,ROW(A298))&\"'!A1\",MID(INDEX(x,ROW(A298)),FIND(\"]\",INDEX(x,ROW(A298)))+1,31)))","v":""}]
[null,{"$f":"IF(ROW(A299)>COUNTA(x),\"\",HYPERLINK(\"#'\"&INDEX(x,ROW(A299))&\"'!A1\",MID(INDEX(x,ROW(A299)),FIND(\"]\",INDEX(x,ROW(A299)))+1,31)))","v":""}]
[null,{"$f":"IF(ROW(A300)>COUNTA(x),\"\",HYPERLINK(\"#'\"&INDEX(x,ROW(A300))&\"'!A1\",MID(INDEX(x,ROW(A300)),FIND(\"]\",INDEX(x,ROW(A300)))+1,31)))","v":""}]
[null,{"$f":"IF(ROW(A301)>COUNTA(x),\"\",HYPERLINK(\"#'\"&INDEX(x,ROW(A301))&\"'!A1\",MID(INDEX(x,ROW(A301)),FIND(\"]\",INDEX(x,ROW(A301)))+1,31)))","v":""}]
[null,{"$f":"IF(ROW(A302)>COUNTA(x),\"\",HYPERLINK(\"#'\"&INDEX(x,ROW(A302))&\"'!A1\",MID(INDEX(x,ROW(A302)),FIND(\"]\",INDEX(x,ROW(A302)))+1,31)))","v":""}]
[null,{"$f":"IF(ROW(A303)>COUNTA(x),\"\",HYPERLINK(\"#'\"&INDEX(x,ROW(A303))&\"'!A1\",MID(INDEX(x,ROW(A303)),FIND(\"]\",INDEX(x,ROW(A303)))+1,31)))","v":""}]
[null,{"$f":"IF(ROW(A304)>COUNTA(x),\"\",HYPERLINK(\"#'\"&INDEX(x,ROW(A304))&\"'!A1\",MID(INDEX(x,ROW(A304)),FIND(\"]\",INDEX(x,ROW(A304)))+1,31)))","v":""}]
[null,{"$f":"IF(ROW(A305)>COUNTA(x),\"\",HYPERLINK(\"#'\"&INDEX(x,ROW(A305))&\"'!A1\",MID(INDEX(x,ROW(A305)),FIND(\"]\",INDEX(x,ROW(A305)))+1,31)))","v":""}]
[null,{"$f":"IF(ROW(A306)>COUNTA(x),\"\",HYPERLINK(\"#'\"&INDEX(x,ROW(A306))&\"'!A1\",MID(INDEX(x,ROW(A306)),FIND(\"]\",INDEX(x,ROW(A306)))+1,31)))","v":""}]
[null,{"$f":"IF(ROW(A307)>COUNTA(x),\"\",HYPERLINK(\"#'\"&INDEX(x,ROW(A307))&\"'!A1\",MID(INDEX(x,ROW(A307)),FIND(\"]\",INDEX(x,ROW(A307)))+1,31)))","v":""}]
[null,{"$f":"IF(ROW(A308)>COUNTA(x),\"\",HYPERLINK(\"#'\"&INDEX(x,ROW(A308))&\"'!A1\",MID(INDEX(x,ROW(A308)),FIND(\"]\",INDEX(x,ROW(A308)))+1,31)))","v":""}]
[null,{"$f":"IF(ROW(A309)>COUNTA(x),\"\",HYPERLINK(\"#'\"&INDEX(x,ROW(A309))&\"'!A1\",MID(INDEX(x,ROW(A309)),FIND(\"]\",INDEX(x,ROW(A309)))+1,31)))","v":""}]
[null,{"$f":"IF(ROW(A310)>COUNTA(x),\"\",HYPERLINK(\"#'\"&INDEX(x,ROW(A310))&\"'!A1\",MID(INDEX(x,ROW(A310)),FIND(\"]\",INDEX(x,ROW(A310)))+1,31)))","v":""}]
[null,{"$f":"IF(ROW(A311)>COUNTA(x),\"\",HYPERLINK(\"#'\"&INDEX(x,ROW(A311))&\"'!A1\",MID(INDEX(x,ROW(A311)),FIND(\"]\",INDEX(x,ROW(A311)))+1,31)))","v":""}]
[null,{"$f":"IF(ROW(A312)>COUNTA(x),\"\",HYPERLINK(\"#'\"&INDEX(x,ROW(A312))&\"'!A1\",MID(INDEX(x,ROW(A312)),FIND(\"]\",INDEX(x,ROW(A312)))+1,31)))","v":""}]
[null,{"$f":"IF(ROW(A313)>COUNTA(x),\"\",HYPERLINK(\"#'\"&INDEX(x,ROW(A313))&\"'!A1\",MID(INDEX(x,ROW(A313)),FIND(\"]\",INDEX(x,ROW(A313)))+1,31)))","v":""}]
[null,{"$f":"IF(ROW(A314)>COUNTA(x),\"\",HYPERLINK(\"#'\"&INDEX(x,ROW(A314))&\"'!A1\",MID(INDEX(x,ROW(A314)),FIND(\"]\",INDEX(x,ROW(A314)))+1,31)))","v":""}]
[null,{"$f":"IF(ROW(A315)>COUNTA(x),\"\",HYPERLINK(\"#'\"&INDEX(x,ROW(A315))&\"'!A1\",MID(INDEX(x,ROW(A315)),FIND(\"]\",INDEX(x,ROW(A315)))+1,31)))","v":""}]
[null,{"$f":"IF(ROW(A316)>COUNTA(x),\"\",HYPERLINK(\"#'\"&INDEX(x,ROW(A316))&\"'!A1\",MID(INDEX(x,ROW(A316)),FIND(\"]\",INDEX(x,ROW(A316)))+1,31)))","v":""}]
[null,{"$f":"IF(ROW(A317)>COUNTA(x),\"\",HYPERLINK(\"#'\"&INDEX(x,ROW(A317))&\"'!A1\",MID(INDEX(x,ROW(A317)),FIND(\"]\",INDEX(x,ROW(A317)))+1,31)))","v":""}]
[null,{"$f":"IF(ROW(A318)>COUNTA(x),\"\",HYPERLINK(\"#'\"&INDEX(x,ROW(A318))&\"'!A1\",MID(INDEX(x,ROW(A318)),FIND(\"]\",INDEX(x,ROW(A318)))+1,31)))","v":""}]
[null,{"$f":"IF(ROW(A319)>COUNTA(x),\"\",HYPERLINK(\"#'\"&INDEX(x,ROW(A319))&\"'!A1\",MID(INDEX(x,ROW(A319)),FIND(\"]\",INDEX(x,ROW(A319)))+1,31)))","v":""}]
[null,{"$f":"IF(ROW(A320)>COUNTA(x),\"\",HYPERLINK(\"#'\"&INDEX(x,ROW(A320))&\"'!A1\",MID(INDEX(x,ROW(A320)),FIND(\"]\",INDEX(x,ROW(A320)))+1,31)))","v":""}]
[null,{"$f":"IF(ROW(A321)>COUNTA(x),\"\",HYPERLINK(\"#'\"&INDEX(x,ROW(A321))&\"'!A1\",MID(INDEX(x,ROW(A321)),FIND(\"]\",INDEX(x,ROW(A321)))+1,31)))","v":""}]
[null,{"$f":"IF(ROW(A322)>COUNTA(x),\"\",HYPERLINK(\"#'\"&INDEX(x,ROW(A322))&\"'!A1\",MID(INDEX(x,ROW(A322)),FIND(\"]\",INDEX(x,ROW(A322)))+1,31)))","v":""}]
[null,{"$f":"IF(ROW(A323)>COUNTA(x),\"\",HYPERLINK(\"#'\"&INDEX(x,ROW(A323))&\"'!A1\",MID(INDEX(x,ROW(A323)),FIND(\"]\",INDEX(x,ROW(A323)))+1,31)))","v":""}]
[null,{"$f":"IF(ROW(A324)>COUNTA(x),\"\",HYPERLINK(\"#'\"&INDEX(x,ROW(A324))&\"'!A1\",MID(INDEX(x,ROW(A324)),FIND(\"]\",INDEX(x,ROW(A324)))+1,31)))","v":""}]
[null,{"$f":"IF(ROW(A325)>COUNTA(x),\"\",HYPERLINK(\"#'\"&INDEX(x,ROW(A325))&\"'!A1\",MID(INDEX(x,ROW(A325)),FIND(\"]\",INDEX(x,ROW(A325)))+1,31)))","v":""}]
[null,{"$f":"IF(ROW(A326)>COUNTA(x),\"\",HYPERLINK(\"#'\"&INDEX(x,ROW(A326))&\"'!A1\",MID(INDEX(x,ROW(A326)),FIND(\"]\",INDEX(x,ROW(A326)))+1,31)))","v":""}]
[null,{"$f":"IF(ROW(A327)>COUNTA(x),\"\",HYPERLINK(\"#'\"&INDEX(x,ROW(A327))&\"'!A1\",MID(INDEX(x,ROW(A327)),FIND(\"]\",INDEX(x,ROW(A327)))+1,31)))","v":""}]
[null,{"$f":"IF(ROW(A328)>COUNTA(x),\"\",HYPERLINK(\"#'\"&INDEX(x,ROW(A328))&\"'!A1\",MID(INDEX(x,ROW(A328)),FIND(\"]\",INDEX(x,ROW(A328)))+1,31)))","v":""}]
[null,{"$f":"IF(ROW(A329)>COUNTA(x),\"\",HYPERLINK(\"#'\"&INDEX(x,ROW(A329))&\"'!A1\",MID(INDEX(x,ROW(A329)),FIND(\"]\",INDEX(x,ROW(A329)))+1,31)))","v":""}]
[null,{"$f":"IF(ROW(A330)>COUNTA(x),\"\",HYPERLINK(\"#'\"&INDEX(x,ROW(A330))&\"'!A1\",MID(INDEX(x,ROW(A330)),FIND(\"]\",INDEX(x,ROW(A330)))+1,31)))","v":""}]
[null,{"$f":"IF(ROW(A331)>COUNTA(x),\"\",HYPERLINK(\"#'\"&INDEX(x,ROW(A331))&\"'!A1\",MID(INDEX(x,ROW(A331)),FIND(\"]\",INDEX(x,ROW(A331)))+1,31)))","v":""}]
[null,{"$f":"IF(ROW(A332)>COUNTA(x),\"\",HYPERLINK(\"#'\"&INDEX(x,ROW(A332))&\"'!A1\",MID(INDEX(x,ROW(A332)),FIND(\"]\",INDEX(x,ROW(A332)))+1,31)))","v":""}]
[null,{"$f":"IF(ROW(A333)>COUNTA(x),\"\",HYPERLINK(\"#'\"&INDEX(x,ROW(A333))&\"'!A1\",MID(INDEX(x,ROW(A333)),FIND(\"]\",INDEX(x,ROW(A333)))+1,31)))","v":""}]
[null,{"$f":"IF(ROW(A334)>COUNTA(x),\"\",HYPERLINK(\"#'\"&INDEX(x,ROW(A334))&\"'!A1\",MID(INDEX(x,ROW(A334)),FIND(\"]\",INDEX(x,ROW(A334)))+1,31)))","v":""}]
[null,{"$f":"IF(ROW(A335)>COUNTA(x),\"\",HYPERLINK(\"#'\"&INDEX(x,ROW(A335))&\"'!A1\",MID(INDEX(x,ROW(A335)),FIND(\"]\",INDEX(x,ROW(A335)))+1,31)))","v":""}]
[null,{"$f":"IF(ROW(A336)>COUNTA(x),\"\",HYPERLINK(\"#'\"&INDEX(x,ROW(A336))&\"'!A1\",MID(INDEX(x,ROW(A336)),FIND(\"]\",INDEX(x,ROW(A336)))+1,31)))","v":""}]
[null,{"$f":"IF(ROW(A337)>COUNTA(x),\"\",HYPERLINK(\"#'\"&INDEX(x,ROW(A337))&\"'!A1\",MID(INDEX(x,ROW(A337)),FIND(\"]\",INDEX(x,ROW(A337)))+1,31)))","v":""}]
[null,{"$f":"IF(ROW(A338)>COUNTA(x),\"\",HYPERLINK(\"#'\"&INDEX(x,ROW(A338))&\"'!A1\",MID(INDEX(x,ROW(A338)),FIND(\"]\",INDEX(x,ROW(A338)))+1,31)))","v":""}]
[null,{"$f":"IF(ROW(A339)>COUNTA(x),\"\",HYPERLINK(\"#'\"&INDEX(x,ROW(A339))&\"'!A1\",MID(INDEX(x,ROW(A339)),FIND(\"]\",INDEX(x,ROW(A339)))+1,31)))","v":""}]
[null,{"$f":"IF(ROW(A340)>COUNTA(x),\"\",HYPERLINK(\"#'\"&INDEX(x,ROW(A340))&\"'!A1\",MID(INDEX(x,ROW(A340)),FIND(\"]\",INDEX(x,ROW(A340)))+1,31)))","v":""}]
[null,{"$f":"IF(ROW(A341)>COUNTA(x),\"\",HYPERLINK(\"#'\"&INDEX(x,ROW(A341))&\"'!A1\",MID(INDEX(x,ROW(A341)),FIND(\"]\",INDEX(x,ROW(A341)))+1,31)))","v":""}]
[null,{"$f":"IF(ROW(A342)>COUNTA(x),\"\",HYPERLINK(\"#'\"&INDEX(x,ROW(A342))&\"'!A1\",MID(INDEX(x,ROW(A342)),FIND(\"]\",INDEX(x,ROW(A342)))+1,31)))","v":""}]
[null,{"$f":"IF(ROW(A343)>COUNTA(x),\"\",HYPERLINK(\"#'\"&INDEX(x,ROW(A343))&\"'!A1\",MID(INDEX(x,ROW(A343)),FIND(\"]\",INDEX(x,ROW(A343)))+1,31)))","v":""}]
[null,{"$f":"IF(ROW(A344)>COUNTA(x),\"\",HYPERLINK(\"#'\"&INDEX(x,ROW(A344))&\"'!A1\",MID(INDEX(x,ROW(A344)),FIND(\"]\",INDEX(x,ROW(A344)))+1,31)))","v":""}]
[null,{"$f":"IF(ROW(A345)>COUNTA(x),\"\",HYPERLINK(\"#'\"&INDEX(x,ROW(A345))&\"'!A1\",MID(INDEX(x,ROW(A345)),FIND(\"]\",INDEX(x,ROW(A345)))+1,31)))","v":""}]
[null,{"$f":"IF(ROW(A346)>COUNTA(x),\"\",HYPERLINK(\"#'\"&INDEX(x,ROW(A346))&\"'!A1\",MID(INDEX(x,ROW(A346)),FIND(\"]\",INDEX(x,ROW(A346)))+1,31)))","v":""}]
[null,{"$f":"IF(ROW(A347)>COUNTA(x),\"\",HYPERLINK(\"#'\"&INDEX(x,ROW(A347))&\"'!A1\",MID(INDEX(x,ROW(A347)),FIND(\"]\",INDEX(x,ROW(A347)))+1,31)))","v":""}]
[null,{"$f":"IF(ROW(A348)>COUNTA(x),\"\",HYPERLINK(\"#'\"&INDEX(x,ROW(A348))&\"'!A1\",MID(INDEX(x,ROW(A348)),FIND(\"]\",INDEX(x,ROW(A348)))+1,31)))","v":""}]
[null,{"$f":"IF(ROW(A349)>COUNTA(x),\"\",HYPERLINK(\"#'\"&INDEX(x,ROW(A349))&\"'!A1\",MID(INDEX(x,ROW(A349)),FIND(\"]\",INDEX(x,ROW(A349)))+1,31)))","v":""}]
[null,{"$f":"IF(ROW(A350)>COUNTA(x),\"\",HYPERLINK(\"#'\"&INDEX(x,ROW(A350))&\"'!A1\",MID(INDEX(x,ROW(A350)),FIND(\"]\",INDEX(x,ROW(A350)))+1,31)))","v":""}]
[null,{"$f":"IF(ROW(A351)>COUNTA(x),\"\",HYPERLINK(\"#'\"&INDEX(x,ROW(A351))&\"'!A1\",MID(INDEX(x,ROW(A351)),FIND(\"]\",INDEX(x,ROW(A351)))+1,31)))","v":""}]
[null,{"$f":"IF(ROW(A352)>COUNTA(x),\"\",HYPERLINK(\"#'\"&INDEX(x,ROW(A352))&\"'!A1\",MID(INDEX(x,ROW(A352)),FIND(\"]\",INDEX(x,ROW(A352)))+1,31)))","v":""}]
[null,{"$f":"IF(ROW(A353)>COUNTA(x),\"\",HYPERLINK(\"#'\"&INDEX(x,ROW(A353))&\"'!A1\",MID(INDEX(x,ROW(A353)),FIND(\"]\",INDEX(x,ROW(A353)))+1,31)))","v":""}]
[null,{"$f":"IF(ROW(A354)>COUNTA(x),\"\",HYPERLINK(\"#'\"&INDEX(x,ROW(A354))&\"'!A1\",MID(INDEX(x,ROW(A354)),FIND(\"]\",INDEX(x,ROW(A354)))+1,31)))","v":""}]
[null,{"$f":"IF(ROW(A355)>COUNTA(x),\"\",HYPERLINK(\"#'\"&INDEX(x,ROW(A355))&\"'!A1\",MID(INDEX(x,ROW(A355)),FIND(\"]\",INDEX(x,ROW(A355)))+1,31)))","v":""}]
[null,{"$f":"IF(ROW(A356)>COUNTA(x),\"\",HYPERLINK(\"#'\"&INDEX(x,ROW(A356))&\"'!A1\",MID(INDEX(x,ROW(A356)),FIND(\"]\",INDEX(x,ROW(A356)))+1,31)))","v":""}]
[null,{"$f":"IF(ROW(A357)>COUNTA(x),\"\",HYPERLINK(\"#'\"&INDEX(x,ROW(A357))&\"'!A1\",MID(INDEX(x,ROW(A357)),FIND(\"]\",INDEX(x,ROW(A357)))+1,31)))","v":""}]
[null,{"$f":"IF(ROW(A358)>COUNTA(x),\"\",HYPERLINK(\"#'\"&INDEX(x,ROW(A358))&\"'!A1\",MID(INDEX(x,ROW(A358)),FIND(\"]\",INDEX(x,ROW(A358)))+1,31)))","v":""}]
[null,{"$f":"IF(ROW(A359)>COUNTA(x),\"\",HYPERLINK(\"#'\"&INDEX(x,ROW(A359))&\"'!A1\",MID(INDEX(x,ROW(A359)),FIND(\"]\",INDEX(x,ROW(A359)))+1,31)))","v":""}]
[null,{"$f":"IF(ROW(A360)>COUNTA(x),\"\",HYPERLINK(\"#'\"&INDEX(x,ROW(A360))&\"'!A1\",MID(INDEX(x,ROW(A360)),FIND(\"]\",INDEX(x,ROW(A360)))+1,31)))","v":""}]
[null,{"$f":"IF(ROW(A361)>COUNTA(x),\"\",HYPERLINK(\"#'\"&INDEX(x,ROW(A361))&\"'!A1\",MID(INDEX(x,ROW(A361)),FIND(\"]\",INDEX(x,ROW(A361)))+1,31)))","v":""}]
[null,{"$f":"IF(ROW(A362)>COUNTA(x),\"\",HYPERLINK(\"#'\"&INDEX(x,ROW(A362))&\"'!A1\",MID(INDEX(x,ROW(A362)),FIND(\"]\",INDEX(x,ROW(A362)))+1,31)))","v":""}]
[null,{"$f":"IF(ROW(A363)>COUNTA(x),\"\",HYPERLINK(\"#'\"&INDEX(x,ROW(A363))&\"'!A1\",MID(INDEX(x,ROW(A363)),FIND(\"]\",INDEX(x,ROW(A363)))+1,31)))","v":""}]
[null,{"$f":"IF(ROW(A364)>COUNTA(x),\"\",HYPERLINK(\"#'\"&INDEX(x,ROW(A364))&\"'!A1\",MID(INDEX(x,ROW(A364)),FIND(\"]\",INDEX(x,ROW(A364)))+1,31)))","v":""}]
[null,{"$f":"IF(ROW(A365)>COUNTA(x),\"\",HYPERLINK(\"#'\"&INDEX(x,ROW(A365))&\"'!A1\",MID(INDEX(x,ROW(A365)),FIND(\"]\",INDEX(x,ROW(A365)))+1,31)))","v":""}]
[null,{"$f":"IF(ROW(A366)>COUNTA(x),\"\",HYPERLINK(\"#'\"&INDEX(x,ROW(A366))&\"'!A1\",MID(INDEX(x,ROW(A366)),FIND(\"]\",INDEX(x,ROW(A366)))+1,31)))","v":""}]
[null,{"$f":"IF(ROW(A367)>COUNTA(x),\"\",HYPERLINK(\"#'\"&INDEX(x,ROW(A367))&\"'!A1\",MID(INDEX(x,ROW(A367)),FIND(\"]\",INDEX(x,ROW(A367)))+1,31)))","v":""}]
[null,{"$f":"IF(ROW(A368)>COUNTA(x),\"\",HYPERLINK(\"#'\"&INDEX(x,ROW(A368))&\"'!A1\",MID(INDEX(x,ROW(A368)),FIND(\"]\",INDEX(x,ROW(A368)))+1,31)))","v":""}]
[null,{"$f":"IF(ROW(A369)>COUNTA(x),\"\",HYPERLINK(\"#'\"&INDEX(x,ROW(A369))&\"'!A1\",MID(INDEX(x,ROW(A369)),FIND(\"]\",INDEX(x,ROW(A369)))+1,31)))","v":""}]
[null,{"$f":"IF(ROW(A370)>COUNTA(x),\"\",HYPERLINK(\"#'\"&INDEX(x,ROW(A370))&\"'!A1\",MID(INDEX(x,ROW(A370)),FIND(\"]\",INDEX(x,ROW(A370)))+1,31)))","v":""}]
[null,{"$f":"IF(ROW(A371)>COUNTA(x),\"\",HYPERLINK(\"#'\"&INDEX(x,ROW(A371))&\"'!A1\",MID(INDEX(x,ROW(A371)),FIND(\"]\",INDEX(x,ROW(A371)))+1,31)))","v":""}]
[null,{"$f":"IF(ROW(A372)>COUNTA(x),\"\",HYPERLINK(\"#'\"&INDEX(x,ROW(A372))&\"'!A1\",MID(INDEX(x,ROW(A372)),FIND(\"]\",INDEX(x,ROW(A372)))+1,31)))","v":""}]
[null,{"$f":"IF(ROW(A373)>COUNTA(x),\"\",HYPERLINK(\"#'\"&INDEX(x,ROW(A373))&\"'!A1\",MID(INDEX(x,ROW(A373)),FIND(\"]\",INDEX(x,ROW(A373)))+1,31)))","v":""}]
[null,{"$f":"IF(ROW(A374)>COUNTA(x),\"\",HYPERLINK(\"#'\"&INDEX(x,ROW(A374))&\"'!A1\",MID(INDEX(x,ROW(A374)),FIND(\"]\",INDEX(x,ROW(A374)))+1,31)))","v":""}]
[null,{"$f":"IF(ROW(A375)>COUNTA(x),\"\",HYPERLINK(\"#'\"&INDEX(x,ROW(A375))&\"'!A1\",MID(INDEX(x,ROW(A375)),FIND(\"]\",INDEX(x,ROW(A375)))+1,31)))","v":""}]
[null,{"$f":"IF(ROW(A376)>COUNTA(x),\"\",HYPERLINK(\"#'\"&INDEX(x,ROW(A376))&\"'!A1\",MID(INDEX(x,ROW(A376)),FIND(\"]\",INDEX(x,ROW(A376)))+1,31)))","v":""}]
[null,{"$f":"IF(ROW(A377)>COUNTA(x),\"\",HYPERLINK(\"#'\"&INDEX(x,ROW(A377))&\"'!A1\",MID(INDEX(x,ROW(A377)),FIND(\"]\",INDEX(x,ROW(A377)))+1,31)))","v":""}]
[null,{"$f":"IF(ROW(A378)>COUNTA(x),\"\",HYPERLINK(\"#'\"&INDEX(x,ROW(A378))&\"'!A1\",MID(INDEX(x,ROW(A378)),FIND(\"]\",INDEX(x,ROW(A378)))+1,31)))","v":""}]
[null,{"$f":"IF(ROW(A379)>COUNTA(x),\"\",HYPERLINK(\"#'\"&INDEX(x,ROW(A379))&\"'!A1\",MID(INDEX(x,ROW(A379)),FIND(\"]\",INDEX(x,ROW(A379)))+1,31)))","v":""}]
[null,{"$f":"IF(ROW(A380)>COUNTA(x),\"\",HYPERLINK(\"#'\"&INDEX(x,ROW(A380))&\"'!A1\",MID(INDEX(x,ROW(A380)),FIND(\"]\",INDEX(x,ROW(A380)))+1,31)))","v":""}]
[null,{"$f":"IF(ROW(A381)>COUNTA(x),\"\",HYPERLINK(\"#'\"&INDEX(x,ROW(A381))&\"'!A1\",MID(INDEX(x,ROW(A381)),FIND(\"]\",INDEX(x,ROW(A381)))+1,31)))","v":""}]
[null,{"$f":"IF(ROW(A382)>COUNTA(x),\"\",HYPERLINK(\"#'\"&INDEX(x,ROW(A382))&\"'!A1\",MID(INDEX(x,ROW(A382)),FIND(\"]\",INDEX(x,ROW(A382)))+1,31)))","v":""}]
[null,{"$f":"IF(ROW(A383)>COUNTA(x),\"\",HYPERLINK(\"#'\"&INDEX(x,ROW(A383))&\"'!A1\",MID(INDEX(x,ROW(A383)),FIND(\"]\",INDEX(x,ROW(A383)))+1,31)))","v":""}]
[null,{"$f":"IF(ROW(A384)>COUNTA(x),\"\",HYPERLINK(\"#'\"&INDEX(x,ROW(A384))&\"'!A1\",MID(INDEX(x,ROW(A384)),FIND(\"]\",INDEX(x,ROW(A384)))+1,31)))","v":""}]
[null,{"$f":"IF(ROW(A385)>COUNTA(x),\"\",HYPERLINK(\"#'\"&INDEX(x,ROW(A385))&\"'!A1\",MID(INDEX(x,ROW(A385)),FIND(\"]\",INDEX(x,ROW(A385)))+1,31)))","v":""}]
[null,{"$f":"IF(ROW(A386)>COUNTA(x),\"\",HYPERLINK(\"#'\"&INDEX(x,ROW(A386))&\"'!A1\",MID(INDEX(x,ROW(A386)),FIND(\"]\",INDEX(x,ROW(A386)))+1,31)))","v":""}]
[null,{"$f":"IF(ROW(A387)>COUNTA(x),\"\",HYPERLINK(\"#'\"&INDEX(x,ROW(A387))&\"'!A1\",MID(INDEX(x,ROW(A387)),FIND(\"]\",INDEX(x,ROW(A387)))+1,31)))","v":""}]
[null,{"$f":"IF(ROW(A388)>COUNTA(x),\"\",HYPERLINK(\"#'\"&INDEX(x,ROW(A388))&\"'!A1\",MID(INDEX(x,ROW(A388)),FIND(\"]\",INDEX(x,ROW(A388)))+1,31)))","v":""}]
[null,{"$f":"IF(ROW(A389)>COUNTA(x),\"\",HYPERLINK(\"#'\"&INDEX(x,ROW(A389))&\"'!A1\",MID(INDEX(x,ROW(A389)),FIND(\"]\",INDEX(x,ROW(A389)))+1,31)))","v":""}]
[null,{"$f":"IF(ROW(A390)>COUNTA(x),\"\",HYPERLINK(\"#'\"&INDEX(x,ROW(A390))&\"'!A1\",MID(INDEX(x,ROW(A390)),FIND(\"]\",INDEX(x,ROW(A390)))+1,31)))","v":""}]
[null,{"$f":"IF(ROW(A391)>COUNTA(x),\"\",HYPERLINK(\"#'\"&INDEX(x,ROW(A391))&\"'!A1\",MID(INDEX(x,ROW(A391)),FIND(\"]\",INDEX(x,ROW(A391)))+1,31)))","v":""}]
[null,{"$f":"IF(ROW(A392)>COUNTA(x),\"\",HYPERLINK(\"#'\"&INDEX(x,ROW(A392))&\"'!A1\",MID(INDEX(x,ROW(A392)),FIND(\"]\",INDEX(x,ROW(A392)))+1,31)))","v":""}]
[null,{"$f":"IF(ROW(A393)>COUNTA(x),\"\",HYPERLINK(\"#'\"&INDEX(x,ROW(A393))&\"'!A1\",MID(INDEX(x,ROW(A393)),FIND(\"]\",INDEX(x,ROW(A393)))+1,31)))","v":""}]
[null,{"$f":"IF(ROW(A394)>COUNTA(x),\"\",HYPERLINK(\"#'\"&INDEX(x,ROW(A394))&\"'!A1\",MID(INDEX(x,ROW(A394)),FIND(\"]\",INDEX(x,ROW(A394)))+1,31)))","v":""}]
[null,{"$f":"IF(ROW(A395)>COUNTA(x),\"\",HYPERLINK(\"#'\"&INDEX(x,ROW(A395))&\"'!A1\",MID(INDEX(x,ROW(A395)),FIND(\"]\",INDEX(x,ROW(A395)))+1,31)))","v":""}]
[null,{"$f":"IF(ROW(A396)>COUNTA(x),\"\",HYPERLINK(\"#'\"&INDEX(x,ROW(A396))&\"'!A1\",MID(INDEX(x,ROW(A396)),FIND(\"]\",INDEX(x,ROW(A396)))+1,31)))","v":""}]
[null,{"$f":"IF(ROW(A397)>COUNTA(x),\"\",HYPERLINK(\"#'\"&INDEX(x,ROW(A397))&\"'!A1\",MID(INDEX(x,ROW(A397)),FIND(\"]\",INDEX(x,ROW(A397)))+1,31)))","v":""}]
[null,{"$f":"IF(ROW(A398)>COUNTA(x),\"\",HYPERLINK(\"#'\"&INDEX(x,ROW(A398))&\"'!A1\",MID(INDEX(x,ROW(A398)),FIND(\"]\",INDEX(x,ROW(A398)))+1,31)))","v":""}]
[null,{"$f":"IF(ROW(A399)>COUNTA(x),\"\",HYPERLINK(\"#'\"&INDEX(x,ROW(A399))&\"'!A1\",MID(INDEX(x,ROW(A399)),FIND(\"]\",INDEX(x,ROW(A399)))+1,31)))","v":""}]
[null,{"$f":"IF(ROW(A400)>COUNTA(x),\"\",HYPERLINK(\"#'\"&INDEX(x,ROW(A400))&\"'!A1\",MID(INDEX(x,ROW(A400)),FIND(\"]\",INDEX(x,ROW(A400)))+1,31)))","v":""}]
[null,{"$f":"IF(ROW(A401)>COUNTA(x),\"\",HYPERLINK(\"#'\"&INDEX(x,ROW(A401))&\"'!A1\",MID(INDEX(x,ROW(A401)),FIND(\"]\",INDEX(x,ROW(A401)))+1,31)))","v":""}]
[null,{"$f":"IF(ROW(A402)>COUNTA(x),\"\",HYPERLINK(\"#'\"&INDEX(x,ROW(A402))&\"'!A1\",MID(INDEX(x,ROW(A402)),FIND(\"]\",INDEX(x,ROW(A402)))+1,31)))","v":""}]
[null,{"$f":"IF(ROW(A403)>COUNTA(x),\"\",HYPERLINK(\"#'\"&INDEX(x,ROW(A403))&\"'!A1\",MID(INDEX(x,ROW(A403)),FIND(\"]\",INDEX(x,ROW(A403)))+1,31)))","v":""}]
[null,{"$f":"IF(ROW(A404)>COUNTA(x),\"\",HYPERLINK(\"#'\"&INDEX(x,ROW(A404))&\"'!A1\",MID(INDEX(x,ROW(A404)),FIND(\"]\",INDEX(x,ROW(A404)))+1,31)))","v":""}]
[null,{"$f":"IF(ROW(A405)>COUNTA(x),\"\",HYPERLINK(\"#'\"&INDEX(x,ROW(A405))&\"'!A1\",MID(INDEX(x,ROW(A405)),FIND(\"]\",INDEX(x,ROW(A405)))+1,31)))","v":""}]
[null,{"$f":"IF(ROW(A406)>COUNTA(x),\"\",HYPERLINK(\"#'\"&INDEX(x,ROW(A406))&\"'!A1\",MID(INDEX(x,ROW(A406)),FIND(\"]\",INDEX(x,ROW(A406)))+1,31)))","v":""}]
[null,{"$f":"IF(ROW(A407)>COUNTA(x),\"\",HYPERLINK(\"#'\"&INDEX(x,ROW(A407))&\"'!A1\",MID(INDEX(x,ROW(A407)),FIND(\"]\",INDEX(x,ROW(A407)))+1,31)))","v":""}]
[null,{"$f":"IF(ROW(A408)>COUNTA(x),\"\",HYPERLINK(\"#'\"&INDEX(x,ROW(A408))&\"'!A1\",MID(INDEX(x,ROW(A408)),FIND(\"]\",INDEX(x,ROW(A408)))+1,31)))","v":""}]
[null,{"$f":"IF(ROW(A409)>COUNTA(x),\"\",HYPERLINK(\"#'\"&INDEX(x,ROW(A409))&\"'!A1\",MID(INDEX(x,ROW(A409)),FIND(\"]\",INDEX(x,ROW(A409)))+1,31)))","v":""}]
[null,{"$f":"IF(ROW(A410)>COUNTA(x),\"\",HYPERLINK(\"#'\"&INDEX(x,ROW(A410))&\"'!A1\",MID(INDEX(x,ROW(A410)),FIND(\"]\",INDEX(x,ROW(A410)))+1,31)))","v":""}]
[null,{"$f":"IF(ROW(A411)>COUNTA(x),\"\",HYPERLINK(\"#'\"&INDEX(x,ROW(A411))&\"'!A1\",MID(INDEX(x,ROW(A411)),FIND(\"]\",INDEX(x,ROW(A411)))+1,31)))","v":""}]
[null,{"$f":"IF(ROW(A412)>COUNTA(x),\"\",HYPERLINK(\"#'\"&INDEX(x,ROW(A412))&\"'!A1\",MID(INDEX(x,ROW(A412)),FIND(\"]\",INDEX(x,ROW(A412)))+1,31)))","v":""}]
[null,{"$f":"IF(ROW(A413)>COUNTA(x),\"\",HYPERLINK(\"#'\"&INDEX(x,ROW(A413))&\"'!A1\",MID(INDEX(x,ROW(A413)),FIND(\"]\",INDEX(x,ROW(A413)))+1,31)))","v":""}]
[null,{"$f":"IF(ROW(A414)>COUNTA(x),\"\",HYPERLINK(\"#'\"&INDEX(x,ROW(A414))&\"'!A1\",MID(INDEX(x,ROW(A414)),FIND(\"]\",INDEX(x,ROW(A414)))+1,31)))","v":""}]
[null,{"$f":"IF(ROW(A415)>COUNTA(x),\"\",HYPERLINK(\"#'\"&INDEX(x,ROW(A415))&\"'!A1\",MID(INDEX(x,ROW(A415)),FIND(\"]\",INDEX(x,ROW(A415)))+1,31)))","v":""}]
[null,{"$f":"IF(ROW(A416)>COUNTA(x),\"\",HYPERLINK(\"#'\"&INDEX(x,ROW(A416))&\"'!A1\",MID(INDEX(x,ROW(A416)),FIND(\"]\",INDEX(x,ROW(A416)))+1,31)))","v":""}]
[null,{"$f":"IF(ROW(A417)>COUNTA(x),\"\",HYPERLINK(\"#'\"&INDEX(x,ROW(A417))&\"'!A1\",MID(INDEX(x,ROW(A417)),FIND(\"]\",INDEX(x,ROW(A417)))+1,31)))","v":""}]
[null,{"$f":"IF(ROW(A418)>COUNTA(x),\"\",HYPERLINK(\"#'\"&INDEX(x,ROW(A418))&\"'!A1\",MID(INDEX(x,ROW(A418)),FIND(\"]\",INDEX(x,ROW(A418)))+1,31)))","v":""}]
[null,{"$f":"IF(ROW(A419)>COUNTA(x),\"\",HYPERLINK(\"#'\"&INDEX(x,ROW(A419))&\"'!A1\",MID(INDEX(x,ROW(A419)),FIND(\"]\",INDEX(x,ROW(A419)))+1,31)))","v":""}]
[null,{"$f":"IF(ROW(A420)>COUNTA(x),\"\",HYPERLINK(\"#'\"&INDEX(x,ROW(A420))&\"'!A1\",MID(INDEX(x,ROW(A420)),FIND(\"]\",INDEX(x,ROW(A420)))+1,31)))","v":""}]
[null,{"$f":"IF(ROW(A421)>COUNTA(x),\"\",HYPERLINK(\"#'\"&INDEX(x,ROW(A421))&\"'!A1\",MID(INDEX(x,ROW(A421)),FIND(\"]\",INDEX(x,ROW(A421)))+1,31)))","v":""}]
[null,{"$f":"IF(ROW(A422)>COUNTA(x),\"\",HYPERLINK(\"#'\"&INDEX(x,ROW(A422))&\"'!A1\",MID(INDEX(x,ROW(A422)),FIND(\"]\",INDEX(x,ROW(A422)))+1,31)))","v":""}]
[null,{"$f":"IF(ROW(A423)>COUNTA(x),\"\",HYPERLINK(\"#'\"&INDEX(x,ROW(A423))&\"'!A1\",MID(INDEX(x,ROW(A423)),FIND(\"]\",INDEX(x,ROW(A423)))+1,31)))","v":""}]
[null,{"$f":"IF(ROW(A424)>COUNTA(x),\"\",HYPERLINK(\"#'\"&INDEX(x,ROW(A424))&\"'!A1\",MID(INDEX(x,ROW(A424)),FIND(\"]\",INDEX(x,ROW(A424)))+1,31)))","v":""}]
[null,{"$f":"IF(ROW(A425)>COUNTA(x),\"\",HYPERLINK(\"#'\"&INDEX(x,ROW(A425))&\"'!A1\",MID(INDEX(x,ROW(A425)),FIND(\"]\",INDEX(x,ROW(A425)))+1,31)))","v":""}]
[null,{"$f":"IF(ROW(A426)>COUNTA(x),\"\",HYPERLINK(\"#'\"&INDEX(x,ROW(A426))&\"'!A1\",MID(INDEX(x,ROW(A426)),FIND(\"]\",INDEX(x,ROW(A426)))+1,31)))","v":""}]
[null,{"$f":"IF(ROW(A427)>COUNTA(x),\"\",HYPERLINK(\"#'\"&INDEX(x,ROW(A427))&\"'!A1\",MID(INDEX(x,ROW(A427)),FIND(\"]\",INDEX(x,ROW(A427)))+1,31)))","v":""}]
[null,{"$f":"IF(ROW(A428)>COUNTA(x),\"\",HYPERLINK(\"#'\"&INDEX(x,ROW(A428))&\"'!A1\",MID(INDEX(x,ROW(A428)),FIND(\"]\",INDEX(x,ROW(A428)))+1,31)))","v":""}]
[null,{"$f":"IF(ROW(A429)>COUNTA(x),\"\",HYPERLINK(\"#'\"&INDEX(x,ROW(A429))&\"'!A1\",MID(INDEX(x,ROW(A429)),FIND(\"]\",INDEX(x,ROW(A429)))+1,31)))","v":""}]
[null,{"$f":"IF(ROW(A430)>COUNTA(x),\"\",HYPERLINK(\"#'\"&INDEX(x,ROW(A430))&\"'!A1\",MID(INDEX(x,ROW(A430)),FIND(\"]\",INDEX(x,ROW(A430)))+1,31)))","v":""}]
[null,{"$f":"IF(ROW(A431)>COUNTA(x),\"\",HYPERLINK(\"#'\"&INDEX(x,ROW(A431))&\"'!A1\",MID(INDEX(x,ROW(A431)),FIND(\"]\",INDEX(x,ROW(A431)))+1,31)))","v":""}]
[null,{"$f":"IF(ROW(A432)>COUNTA(x),\"\",HYPERLINK(\"#'\"&INDEX(x,ROW(A432))&\"'!A1\",MID(INDEX(x,ROW(A432)),FIND(\"]\",INDEX(x,ROW(A432)))+1,31)))","v":""}]
[null,{"$f":"IF(ROW(A433)>COUNTA(x),\"\",HYPERLINK(\"#'\"&INDEX(x,ROW(A433))&\"'!A1\",MID(INDEX(x,ROW(A433)),FIND(\"]\",INDEX(x,ROW(A433)))+1,31)))","v":""}]
[null,{"$f":"IF(ROW(A434)>COUNTA(x),\"\",HYPERLINK(\"#'\"&INDEX(x,ROW(A434))&\"'!A1\",MID(INDEX(x,ROW(A434)),FIND(\"]\",INDEX(x,ROW(A434)))+1,31)))","v":""}]
[null,{"$f":"IF(ROW(A435)>COUNTA(x),\"\",HYPERLINK(\"#'\"&INDEX(x,ROW(A435))&\"'!A1\",MID(INDEX(x,ROW(A435)),FIND(\"]\",INDEX(x,ROW(A435)))+1,31)))","v":""}]
[null,{"$f":"IF(ROW(A436)>COUNTA(x),\"\",HYPERLINK(\"#'\"&INDEX(x,ROW(A436))&\"'!A1\",MID(INDEX(x,ROW(A436)),FIND(\"]\",INDEX(x,ROW(A436)))+1,31)))","v":""}]
[null,{"$f":"IF(ROW(A437)>COUNTA(x),\"\",HYPERLINK(\"#'\"&INDEX(x,ROW(A437))&\"'!A1\",MID(INDEX(x,ROW(A437)),FIND(\"]\",INDEX(x,ROW(A437)))+1,31)))","v":""}]
[null,{"$f":"IF(ROW(A438)>COUNTA(x),\"\",HYPERLINK(\"#'\"&INDEX(x,ROW(A438))&\"'!A1\",MID(INDEX(x,ROW(A438)),FIND(\"]\",INDEX(x,ROW(A438)))+1,31)))","v":""}]
[null,{"$f":"IF(ROW(A439)>COUNTA(x),\"\",HYPERLINK(\"#'\"&INDEX(x,ROW(A439))&\"'!A1\",MID(INDEX(x,ROW(A439)),FIND(\"]\",INDEX(x,ROW(A439)))+1,31)))","v":""}]
[null,{"$f":"IF(ROW(A440)>COUNTA(x),\"\",HYPERLINK(\"#'\"&INDEX(x,ROW(A440))&\"'!A1\",MID(INDEX(x,ROW(A440)),FIND(\"]\",INDEX(x,ROW(A440)))+1,31)))","v":""}]
[null,{"$f":"IF(ROW(A441)>COUNTA(x),\"\",HYPERLINK(\"#'\"&INDEX(x,ROW(A441))&\"'!A1\",MID(INDEX(x,ROW(A441)),FIND(\"]\",INDEX(x,ROW(A441)))+1,31)))","v":""}]
[null,{"$f":"IF(ROW(A442)>COUNTA(x),\"\",HYPERLINK(\"#'\"&INDEX(x,ROW(A442))&\"'!A1\",MID(INDEX(x,ROW(A442)),FIND(\"]\",INDEX(x,ROW(A442)))+1,31)))","v":""}]
[null,{"$f":"IF(ROW(A443)>COUNTA(x),\"\",HYPERLINK(\"#'\"&INDEX(x,ROW(A443))&\"'!A1\",MID(INDEX(x,ROW(A443)),FIND(\"]\",INDEX(x,ROW(A443)))+1,31)))","v":""}]
[null,{"$f":"IF(ROW(A444)>COUNTA(x),\"\",HYPERLINK(\"#'\"&INDEX(x,ROW(A444))&\"'!A1\",MID(INDEX(x,ROW(A444)),FIND(\"]\",INDEX(x,ROW(A444)))+1,31)))","v":""}]
[null,{"$f":"IF(ROW(A445)>COUNTA(x),\"\",HYPERLINK(\"#'\"&INDEX(x,ROW(A445))&\"'!A1\",MID(INDEX(x,ROW(A445)),FIND(\"]\",INDEX(x,ROW(A445)))+1,31)))","v":""}]
[null,{"$f":"IF(ROW(A446)>COUNTA(x),\"\",HYPERLINK(\"#'\"&INDEX(x,ROW(A446))&\"'!A1\",MID(INDEX(x,ROW(A446)),FIND(\"]\",INDEX(x,ROW(A446)))+1,31)))","v":""}]
[null,{"$f":"IF(ROW(A447)>COUNTA(x),\"\",HYPERLINK(\"#'\"&INDEX(x,ROW(A447))&\"'!A1\",MID(INDEX(x,ROW(A447)),FIND(\"]\",INDEX(x,ROW(A447)))+1,31)))","v":""}]
[null,{"$f":"IF(ROW(A448)>COUNTA(x),\"\",HYPERLINK(\"#'\"&INDEX(x,ROW(A448))&\"'!A1\",MID(INDEX(x,ROW(A448)),FIND(\"]\",INDEX(x,ROW(A448)))+1,31)))","v":""}]
[null,{"$f":"IF(ROW(A449)>COUNTA(x),\"\",HYPERLINK(\"#'\"&INDEX(x,ROW(A449))&\"'!A1\",MID(INDEX(x,ROW(A449)),FIND(\"]\",INDEX(x,ROW(A449)))+1,31)))","v":""}]
[null,{"$f":"IF(ROW(A450)>COUNTA(x),\"\",HYPERLINK(\"#'\"&INDEX(x,ROW(A450))&\"'!A1\",MID(INDEX(x,ROW(A450)),FIND(\"]\",INDEX(x,ROW(A450)))+1,31)))","v":""}]
[null,{"$f":"IF(ROW(A451)>COUNTA(x),\"\",HYPERLINK(\"#'\"&INDEX(x,ROW(A451))&\"'!A1\",MID(INDEX(x,ROW(A451)),FIND(\"]\",INDEX(x,ROW(A451)))+1,31)))","v":""}]
[null,{"$f":"IF(ROW(A452)>COUNTA(x),\"\",HYPERLINK(\"#'\"&INDEX(x,ROW(A452))&\"'!A1\",MID(INDEX(x,ROW(A452)),FIND(\"]\",INDEX(x,ROW(A452)))+1,31)))","v":""}]
[null,{"$f":"IF(ROW(A453)>COUNTA(x),\"\",HYPERLINK(\"#'\"&INDEX(x,ROW(A453))&\"'!A1\",MID(INDEX(x,ROW(A453)),FIND(\"]\",INDEX(x,ROW(A453)))+1,31)))","v":""}]
[null,{"$f":"IF(ROW(A454)>COUNTA(x),\"\",HYPERLINK(\"#'\"&INDEX(x,ROW(A454))&\"'!A1\",MID(INDEX(x,ROW(A454)),FIND(\"]\",INDEX(x,ROW(A454)))+1,31)))","v":""}]
[null,{"$f":"IF(ROW(A455)>COUNTA(x),\"\",HYPERLINK(\"#'\"&INDEX(x,ROW(A455))&\"'!A1\",MID(INDEX(x,ROW(A455)),FIND(\"]\",INDEX(x,ROW(A455)))+1,31)))","v":""}]
[null,{"$f":"IF(ROW(A456)>COUNTA(x),\"\",HYPERLINK(\"#'\"&INDEX(x,ROW(A456))&\"'!A1\",MID(INDEX(x,ROW(A456)),FIND(\"]\",INDEX(x,ROW(A456)))+1,31)))","v":""}]
[null,{"$f":"IF(ROW(A457)>COUNTA(x),\"\",HYPERLINK(\"#'\"&INDEX(x,ROW(A457))&\"'!A1\",MID(INDEX(x,ROW(A457)),FIND(\"]\",INDEX(x,ROW(A457)))+1,31)))","v":""}]
[null,{"$f":"IF(ROW(A458)>COUNTA(x),\"\",HYPERLINK(\"#'\"&INDEX(x,ROW(A458))&\"'!A1\",MID(INDEX(x,ROW(A458)),FIND(\"]\",INDEX(x,ROW(A458)))+1,31)))","v":""}]
[null,{"$f":"IF(ROW(A459)>COUNTA(x),\"\",HYPERLINK(\"#'\"&INDEX(x,ROW(A459))&\"'!A1\",MID(INDEX(x,ROW(A459)),FIND(\"]\",INDEX(x,ROW(A459)))+1,31)))","v":""}]
[null,{"$f":"IF(ROW(A460)>COUNTA(x),\"\",HYPERLINK(\"#'\"&INDEX(x,ROW(A460))&\"'!A1\",MID(INDEX(x,ROW(A460)),FIND(\"]\",INDEX(x,ROW(A460)))+1,31)))","v":""}]
[null,{"$f":"IF(ROW(A461)>COUNTA(x),\"\",HYPERLINK(\"#'\"&INDEX(x,ROW(A461))&\"'!A1\",MID(INDEX(x,ROW(A461)),FIND(\"]\",INDEX(x,ROW(A461)))+1,31)))","v":""}]
[null,{"$f":"IF(ROW(A462)>COUNTA(x),\"\",HYPERLINK(\"#'\"&INDEX(x,ROW(A462))&\"'!A1\",MID(INDEX(x,ROW(A462)),FIND(\"]\",INDEX(x,ROW(A462)))+1,31)))","v":""}]
[null,{"$f":"IF(ROW(A463)>COUNTA(x),\"\",HYPERLINK(\"#'\"&INDEX(x,ROW(A463))&\"'!A1\",MID(INDEX(x,ROW(A463)),FIND(\"]\",INDEX(x,ROW(A463)))+1,31)))","v":""}]
[null,{"$f":"IF(ROW(A464)>COUNTA(x),\"\",HYPERLINK(\"#'\"&INDEX(x,ROW(A464))&\"'!A1\",MID(INDEX(x,ROW(A464)),FIND(\"]\",INDEX(x,ROW(A464)))+1,31)))","v":""}]
[null,{"$f":"IF(ROW(A465)>COUNTA(x),\"\",HYPERLINK(\"#'\"&INDEX(x,ROW(A465))&\"'!A1\",MID(INDEX(x,ROW(A465)),FIND(\"]\",INDEX(x,ROW(A465)))+1,31)))","v":""}]
[null,{"$f":"IF(ROW(A466)>COUNTA(x),\"\",HYPERLINK(\"#'\"&INDEX(x,ROW(A466))&\"'!A1\",MID(INDEX(x,ROW(A466)),FIND(\"]\",INDEX(x,ROW(A466)))+1,31)))","v":""}]
[null,{"$f":"IF(ROW(A467)>COUNTA(x),\"\",HYPERLINK(\"#'\"&INDEX(x,ROW(A467))&\"'!A1\",MID(INDEX(x,ROW(A467)),FIND(\"]\",INDEX(x,ROW(A467)))+1,31)))","v":""}]
[null,{"$f":"IF(ROW(A468)>COUNTA(x),\"\",HYPERLINK(\"#'\"&INDEX(x,ROW(A468))&\"'!A1\",MID(INDEX(x,ROW(A468)),FIND(\"]\",INDEX(x,ROW(A468)))+1,31)))","v":""}]
[null,{"$f":"IF(ROW(A469)>COUNTA(x),\"\",HYPERLINK(\"#'\"&INDEX(x,ROW(A469))&\"'!A1\",MID(INDEX(x,ROW(A469)),FIND(\"]\",INDEX(x,ROW(A469)))+1,31)))","v":""}]
[null,{"$f":"IF(ROW(A470)>COUNTA(x),\"\",HYPERLINK(\"#'\"&INDEX(x,ROW(A470))&\"'!A1\",MID(INDEX(x,ROW(A470)),FIND(\"]\",INDEX(x,ROW(A470)))+1,31)))","v":""}]
[null,{"$f":"IF(ROW(A471)>COUNTA(x),\"\",HYPERLINK(\"#'\"&INDEX(x,ROW(A471))&\"'!A1\",MID(INDEX(x,ROW(A471)),FIND(\"]\",INDEX(x,ROW(A471)))+1,31)))","v":""}]
[null,{"$f":"IF(ROW(A472)>COUNTA(x),\"\",HYPERLINK(\"#'\"&INDEX(x,ROW(A472))&\"'!A1\",MID(INDEX(x,ROW(A472)),FIND(\"]\",INDEX(x,ROW(A472)))+1,31)))","v":""}]
[null,{"$f":"IF(ROW(A473)>COUNTA(x),\"\",HYPERLINK(\"#'\"&INDEX(x,ROW(A473))&\"'!A1\",MID(INDEX(x,ROW(A473)),FIND(\"]\",INDEX(x,ROW(A473)))+1,31)))","v":""}]
[null,{"$f":"IF(ROW(A474)>COUNTA(x),\"\",HYPERLINK(\"#'\"&INDEX(x,ROW(A474))&\"'!A1\",MID(INDEX(x,ROW(A474)),FIND(\"]\",INDEX(x,ROW(A474)))+1,31)))","v":""}]
[null,{"$f":"IF(ROW(A475)>COUNTA(x),\"\",HYPERLINK(\"#'\"&INDEX(x,ROW(A475))&\"'!A1\",MID(INDEX(x,ROW(A475)),FIND(\"]\",INDEX(x,ROW(A475)))+1,31)))","v":""}]
[null,{"$f":"IF(ROW(A476)>COUNTA(x),\"\",HYPERLINK(\"#'\"&INDEX(x,ROW(A476))&\"'!A1\",MID(INDEX(x,ROW(A476)),FIND(\"]\",INDEX(x,ROW(A476)))+1,31)))","v":""}]
[null,{"$f":"IF(ROW(A477)>COUNTA(x),\"\",HYPERLINK(\"#'\"&INDEX(x,ROW(A477))&\"'!A1\",MID(INDEX(x,ROW(A477)),FIND(\"]\",INDEX(x,ROW(A477)))+1,31)))","v":""}]
[null,{"$f":"IF(ROW(A478)>COUNTA(x),\"\",HYPERLINK(\"#'\"&INDEX(x,ROW(A478))&\"'!A1\",MID(INDEX(x,ROW(A478)),FIND(\"]\",INDEX(x,ROW(A478)))+1,31)))","v":""}]
[null,{"$f":"IF(ROW(A479)>COUNTA(x),\"\",HYPERLINK(\"#'\"&INDEX(x,ROW(A479))&\"'!A1\",MID(INDEX(x,ROW(A479)),FIND(\"]\",INDEX(x,ROW(A479)))+1,31)))","v":""}]
[null,{"$f":"IF(ROW(A480)>COUNTA(x),\"\",HYPERLINK(\"#'\"&INDEX(x,ROW(A480))&\"'!A1\",MID(INDEX(x,ROW(A480)),FIND(\"]\",INDEX(x,ROW(A480)))+1,31)))","v":""}]
[null,{"$f":"IF(ROW(A481)>COUNTA(x),\"\",HYPERLINK(\"#'\"&INDEX(x,ROW(A481))&\"'!A1\",MID(INDEX(x,ROW(A481)),FIND(\"]\",INDEX(x,ROW(A481)))+1,31)))","v":""}]
[null,{"$f":"IF(ROW(A482)>COUNTA(x),\"\",HYPERLINK(\"#'\"&INDEX(x,ROW(A482))&\"'!A1\",MID(INDEX(x,ROW(A482)),FIND(\"]\",INDEX(x,ROW(A482)))+1,31)))","v":""}]
[null,{"$f":"IF(ROW(A483)>COUNTA(x),\"\",HYPERLINK(\"#'\"&INDEX(x,ROW(A483))&\"'!A1\",MID(INDEX(x,ROW(A483)),FIND(\"]\",INDEX(x,ROW(A483)))+1,31)))","v":""}]
[null,{"$f":"IF(ROW(A484)>COUNTA(x),\"\",HYPERLINK(\"#'\"&INDEX(x,ROW(A484))&\"'!A1\",MID(INDEX(x,ROW(A484)),FIND(\"]\",INDEX(x,ROW(A484)))+1,31)))","v":""}]
[null,{"$f":"IF(ROW(A485)>COUNTA(x),\"\",HYPERLINK(\"#'\"&INDEX(x,ROW(A485))&\"'!A1\",MID(INDEX(x,ROW(A485)),FIND(\"]\",INDEX(x,ROW(A485)))+1,31)))","v":""}]
[null,{"$f":"IF(ROW(A486)>COUNTA(x),\"\",HYPERLINK(\"#'\"&INDEX(x,ROW(A486))&\"'!A1\",MID(INDEX(x,ROW(A486)),FIND(\"]\",INDEX(x,ROW(A486)))+1,31)))","v":""}]
[null,{"$f":"IF(ROW(A487)>COUNTA(x),\"\",HYPERLINK(\"#'\"&INDEX(x,ROW(A487))&\"'!A1\",MID(INDEX(x,ROW(A487)),FIND(\"]\",INDEX(x,ROW(A487)))+1,31)))","v":""}]

{"sheet":"Wie geht's","index":2,"n_rows":211,"n_cols":3,"rows_kept":211,"cut":false,"hidden":false,"merged":[]}
[null,{"$f":"TODAY()","v":"2020-02-05"},{"$f":"RIGHT(CELL(\"dateiname\",A1),LEN(CELL(\"dateiname\",A1))-FIND(\"]\",CELL(\"dateiname\",A1)))&\"  Bedienungsanleitung\"","v":"Wie geht's  Bedienungsanleitung"}]
[]
[null,null,"Hier die Anleitung"]
[]
[]
[]
[]
[]
[]
[]
[]
[]
[]
[]
[]
[]
[]
[]
[]
[]
[]
[]
[]
[]
[]
[]
[]
[]
[]
[]
[]
[]
[]
[]
[]
[]
[]
[]
[]
[]
[]
[]
[]
[]
[]
[]
[]
[]
[]
[]
[]
[]
[]
[]
[]
[]
[]
[]
[]
[]
[]
[]
[]
[]
[]
[]
[]
[]
[]
[]
[]
[]
[]
[]
[]
[]
[]
[]
[]
[]
[]
[]
[]
[]
[]
[]
[]
[]
[]
[]
[]
[]
[]
[]
[]
[]
[]
[]
[]
[]
[]
[]
[]
[]
[]
[]
[]
[]
[]
[]
[]
[]
[]
[]
[]
[]
[]
[]
[]
[]
[]
[]
[]
[]
[]
[]
[]
[]
[]
[]
[]
[]
[]
[]
[]
[]
[]
[]
[]
[]
[]
[]
[]
[]
[]
[]
[]
[]
[]
[]
[]
[]
[]
[]
[]
[]
[]
[]
[]
[]
[]
[]
[]
[]
[]
[]
[]
[]
[]
[]
[]
[]
[]
[]
[]
[]
[]
[]
[]
[]
[]
[]
[]
[]
[]
[]
[]
[]
[]
[]
[]
[]
[]
[]
[]
[]
[]
[]
[]
[]
[]
[]
[]
[]
[]
[]
[]
[]
[]
[]
[null,null,"Das bearbeiten der Datei geht nur wenn man im Admin Bereich mit dem Button BEARBEITEN und dem richtigen Passwort!"]

{"sheet":"Notizen","index":3,"n_rows":10000,"n_cols":3,"rows_kept":10000,"cut":false,"hidden":false,"merged":[]}
[null,{"$f":"TODAY()","v":"2020-02-05"},{"$f":"RIGHT(CELL(\"dateiname\",A1),LEN(CELL(\"dateiname\",A1))-FIND(\"]\",CELL(\"dateiname\",A1)))&\"  Problem\"","v":"Notizen  Problem"}]
["Pos.","Datum:","Werkzeug:"]
[{"$f":"IF(B3>0,1,\"\")","v":1},"2019-01-29T18:09:32","Vorlage erstellen!"]
[{"$f":"IF(B4>0,A3+1,\"\")","v":""}]
[{"$f":"IF(B5>0,A4+1,\"\")","v":""}]
[""]
[""]
[""]
[""]
[""]
[""]
[""]
[""]
[""]
[""]
[""]
[""]
[""]
[""]
[""]
[""]
[""]
[""]
[""]
[""]
[""]
[""]
[""]
[""]
[""]
[""]
[""]
[""]
[""]
[""]
[""]
[""]
[""]
[""]
[""]
[""]
[""]
[""]
[""]
[""]
[""]
[""]
[""]
[""]
[""]
[""]
[""]
[""]
[""]
[""]
[""]
[""]
[""]
[""]
[""]
[""]
[""]
[""]
[""]
[""]
[""]
[""]
[""]
[{"$f":"IF(B69>0,A68+1,\"\")","v":""}]
[""]
[""]
[""]
[""]
[""]
[""]
[""]
[""]
[""]
[""]
[""]
[""]
[""]
[""]
[""]
[""]
[""]
[""]
[""]
[""]
[""]
[""]
[""]
[""]
[""]
[""]
[""]
[""]
[""]
[""]
[""]
[""]
[""]
[""]
[""]
[""]
[""]
[""]
[""]
[""]
[""]
[""]
[""]
[""]
[""]
[""]
[""]
[""]
[""]
[""]
[""]
[""]
[""]
[""]
[""]
[""]
[""]
[""]
[""]
[""]
[""]
[""]
[""]
[{"$f":"IF(B133>0,A132+1,\"\")","v":""}]
[""]
[""]
[""]
[""]
[""]
[""]
[""]
[""]
[""]
[""]
[""]
[""]
[""]
[""]
[""]
[""]
[""]
[""]
[""]
[""]
[""]
[""]
[""]
[""]
[""]
[""]
[""]
[""]
[""]
[""]
[""]
[""]
[""]
[""]
[""]
[""]
[""]
[""]
[""]
[""]
[""]
[""]
[""]
[""]
[""]
[""]
[""]
[""]
[""]
[""]
[""]
[""]
[""]
[""]
[""]
[""]
[""]
[""]
[""]
[""]
[""]
[""]
[""]
[{"$f":"IF(B197>0,A196+1,\"\")","v":""}]
[""]
[""]
[""]
[""]
[""]
[""]
[""]
[""]
[""]
[""]
[""]
[""]
[""]
[""]
[""]
[""]
[""]
[""]
[""]
[""]
[""]
[""]
[""]
[""]
[""]
[""]
[""]
[""]
[""]
[""]
[""]
[""]
[""]
[""]
[""]
[""]
[""]
[""]
[""]
[""]
[""]
[""]
[""]
[""]
[""]
[""]
[""]
[""]
[""]
[""]
[""]
[""]
[""]
[""]
[""]
[""]
[""]
[""]
[""]
[""]
[""]
[""]
[""]
[{"$f":"IF(B261>0,A260+1,\"\")","v":""}]
[""]
[""]
[""]
[""]
[""]
[""]
[""]
[""]
[""]
[""]
[""]
[""]
[""]
[""]
[""]
[""]
[""]
[""]
[""]
[""]
[""]
[""]
[""]
[""]
[""]
[""]
[""]
[""]
[""]
[""]
[""]
[""]
[""]
[""]
[""]
[""]
[""]
[""]
[""]
[""]
[""]
[""]
[""]
[""]
[""]
[""]
[""]
[""]
[""]
[""]
[""]
[""]
[""]
[""]
[""]
[""]
[""]
[""]
[""]
[""]
[""]
[""]
[""]
[{"$f":"IF(B325>0,A324+1,\"\")","v":""}]
[""]
[""]
[""]
[""]
[""]
[""]
[""]
[""]
[""]
[""]
[""]
[""]
[""]
[""]
[""]
[""]
[""]
[""]
[""]
[""]
[""]
[""]
[""]
[""]
[""]
[""]
[""]
[""]
[""]
[""]
[""]
[""]
[""]
[""]
[""]
[""]
[""]
[""]
[""]
[""]
[""]
[""]
[""]
[""]
[""]
[""]
[""]
[""]
[""]
[""]
[""]
[""]
[""]
[""]
[""]
[""]
[""]
[""]
[""]
[""]
[""]
[""]
[""]
[{"$f":"IF(B389>0,A388+1,\"\")","v":""}]
[""]
[""]
[""]
[""]
[""]
[""]
[""]
[""]
[""]
[""]
[""]
[""]
[""]
[""]
[""]
[""]
[""]
[""]
[""]
[""]
[""]
[""]
[""]
[""]
[""]
[""]
[""]
[""]
[""]
[""]
[""]
[""]
[""]
[""]
[""]
[""]
[""]
[""]
[""]
[""]
[""]
[""]
[""]
[""]
[""]
[""]
[""]
[""]
[""]
[""]
[""]
[""]
[""]
[""]
[""]
[""]
[""]
[""]
[""]
[""]
[""]
[""]
[""]
[{"$f":"IF(B453>0,A452+1,\"\")","v":""}]
[""]
[""]
[""]
[""]
[""]
[""]
[""]
[""]
[""]
[""]
[""]
[""]
[""]
[""]
[""]
[""]
[""]
[""]
[""]
[""]
[""]
[""]
[""]
[""]
[""]
[""]
[""]
[""]
[""]
[""]
[""]
[""]
[""]
[""]
[""]
[""]
[""]
[""]
[""]
[""]
[""]
[""]
[""]
[""]
[""]
[""]
[""]
[""]
[""]
[""]
[""]
[""]
[""]
[""]
[""]
[""]
[""]
[""]
[""]
[""]
[""]
[""]
[""]
[{"$f":"IF(B517>0,A516+1,\"\")","v":""}]
[""]
[""]
[""]
[""]
[""]
[""]
[""]
[""]
[""]
[""]
[""]
[""]
[""]
[""]
[""]
[""]
[""]
[""]
[""]
[""]
[""]
[""]
[""]
[""]
[""]
[""]
[""]
[""]
[""]
[""]
[""]
[""]
[""]
[""]
[""]
[""]
[""]
[""]
[""]
[""]
[""]
[""]
[""]
[""]
[""]
[""]
[""]
[""]
[""]
[""]
[""]
[""]
[""]
[""]
[""]
[""]
[""]
[""]
[""]
[""]
[""]
[""]
[""]
[{"$f":"IF(B581>0,A580+1,\"\")","v":""}]
[""]
[""]
[""]
[""]
[""]
[""]
[""]
[""]
[""]
[""]
[""]
[""]
[""]
[""]
[""]
[""]
[""]
[""]
[""]
[""]
[""]
[""]
[""]
[""]
[""]
[""]
[""]
[""]
[""]
[""]
[""]
[""]
[""]
[""]
[""]
[""]
[""]
[""]
[""]
[""]
[""]
[""]
[""]
[""]
[""]
[""]
[""]
[""]
[""]
[""]
[""]
[""]
[""]
[""]
[""]
[""]
[""]
[""]
[""]
[""]
[""]
[""]
[""]
[{"$f":"IF(B645>0,A644+1,\"\")","v":""}]
[""]
[""]
[""]
[""]
[""]
[""]
[""]
[""]
[""]
[""]
[""]
[""]
[""]
[""]
[""]
[""]
[""]
[""]
[""]
[""]
[""]
[""]
[""]
[""]
[""]
[""]
[""]
[""]
[""]
[""]
[""]
[""]
[""]
[""]
[""]
[""]
[""]
[""]
[""]
[""]
[""]
[""]
[""]
[""]
[""]
[""]
[""]
[""]
[""]
[""]
[""]
[""]
[""]
[""]
[""]
[""]
[""]
[""]
[""]
[""]
[""]
[""]
[""]
[{"$f":"IF(B709>0,A708+1,\"\")","v":""}]
[""]
[""]
[""]
[""]
[""]
[""]
[""]
[""]
[""]
[""]
[""]
[""]
[""]
[""]
[""]
[""]
[""]
[""]
[""]
[""]
[""]
[""]
[""]
[""]
[""]
[""]
[""]
[""]
[""]
[""]
[""]
[""]
[""]
[""]
[""]
[""]
[""]
[""]
[""]
[""]
[""]
[""]
[""]
[""]
[""]
[""]
[""]
[""]
[""]
[""]
[""]
[""]
[""]
[""]
[""]
[""]
[""]
[""]
[""]
[""]
[""]
[""]
[""]
[{"$f":"IF(B773>0,A772+1,\"\")","v":""}]
[""]
[""]
[""]
[""]
[""]
[""]
[""]
[""]
[""]
[""]
[""]
[""]
[""]
[""]
[""]
[""]
[""]
[""]
[""]
[""]
[""]
[""]
[""]
[""]
[""]
[""]
[""]
[""]
[""]
[""]
[""]
[""]
[""]
[""]
[""]
[""]
[""]
[""]
[""]
[""]
[""]
[""]
[""]
[""]
[""]
[""]
[""]
[""]
[""]
[""]
[""]
[""]
[""]
[""]
[""]
[""]
[""]
[""]
[""]
[""]
[""]
[""]
[""]
[{"$f":"IF(B837>0,A836+1,\"\")","v":""}]
[""]
[""]
[""]
[""]
[""]
[""]
[""]
[""]
[""]
[""]
[""]
[""]
[""]
[""]
[""]
[""]
[""]
[""]
[""]
[""]
[""]
[""]
[""]
[""]
[""]
[""]
[""]
[""]
[""]
[""]
[""]
[""]
[""]
[""]
[""]
[""]
[""]
[""]
[""]
[""]
[""]
[""]
[""]
[""]
[""]
[""]
[""]
[""]
[""]
[""]
[""]
[""]
[""]
[""]
[""]
[""]
[""]
[""]
[""]
[""]
[""]
[""]
[""]
[{"$f":"IF(B901>0,A900+1,\"\")","v":""}]
[""]
[""]
[""]
[""]
[""]
[""]
[""]
[""]
[""]
[""]
[""]
[""]
[""]
[""]
[""]
[""]
[""]
[""]
[""]
[""]
[""]
[""]
[""]
[""]
[""]
[""]
[""]
[""]
[""]
[""]
[""]
[""]
[""]
[""]
[""]
[""]
[""]
[""]
[""]
[""]
[""]
[""]
[""]
[""]
[""]
[""]
[""]
[""]
[""]
[""]
[""]
[""]
[""]
[""]
[""]
[""]
[""]
[""]
[""]
[""]
[""]
[""]
[""]
[{"$f":"IF(B965>0,A964+1,\"\")","v":""}]
[""]
[""]
[""]
[""]
[""]
[""]
[""]
[""]
[""]
[""]
[""]
[""]
[""]
[""]
[""]
[""]
[""]
[""]
[""]
[""]
[""]
[""]
[""]
[""]
[""]
[""]
[""]
[""]
[""]
[""]
[""]
[""]
[""]
[""]
[""]
[""]
[""]
[""]
[""]
[""]
[""]
[""]
[""]
[""]
[""]
[""]
[""]
[""]
[""]
[""]
[""]
[""]
[""]
[""]
[""]
[""]
[""]
[""]
[""]
[""]
[""]
[""]
[""]
[{"$f":"IF(B1029>0,A1028+1,\"\")","v":""}]
[""]
[""]
[""]
[""]
[""]
[""]
[""]
[""]
[""]
[""]
[""]
[""]
[""]
[""]
[""]
[""]
[""]
[""]
[""]
[""]
[""]
[""]
[""]
[""]
[""]
[""]
[""]
[""]
[""]
[""]
[""]
[""]
[""]
[""]
[""]
[""]
[""]
[""]
[""]
[""]
[""]
[""]
[""]
[""]
[""]
[""]
[""]
[""]
[""]
[""]
[""]
[""]
[""]
[""]
[""]
[""]
[""]
[""]
[""]
[""]
[""]
[""]
[""]
[{"$f":"IF(B1093>0,A1092+1,\"\")","v":""}]
[""]
[""]
[""]
[""]
[""]
[""]
[""]
[""]
[""]
[""]
[""]
[""]
[""]
[""]
[""]
[""]
[""]
[""]
[""]
[""]
[""]
[""]
[""]
[""]
[""]
[""]
[""]
[""]
[""]
[""]
[""]
[""]
[""]
[""]
[""]
[""]
[""]
[""]
[""]
[""]
[""]
[""]
[""]
[""]
[""]
[""]
[""]
[""]
[""]
[""]
[""]
[""]
[""]
[""]
[""]
[""]
[""]
[""]
[""]
[""]
[""]
[""]
[""]
[{"$f":"IF(B1157>0,A1156+1,\"\")","v":""}]
[""]
[""]
[""]
[""]
[""]
[""]
[""]
[""]
[""]
[""]
[""]
[""]
[""]
[""]
[""]
[""]
[""]
[""]
[""]
[""]
[""]
[""]
[""]
[""]
[""]
[""]
[""]
[""]
[""]
[""]
[""]
[""]
[""]
[""]
[""]
[""]
[""]
[""]
[""]
[""]
[""]
[""]
[""]
[""]
[""]
[""]
[""]
[""]
[""]
[""]
[""]
[""]
[""]
[""]
[""]
[""]
[""]
[""]
[""]
[""]
[""]
[""]
[""]
[{"$f":"IF(B1221>0,A1220+1,\"\")","v":""}]
[""]
[""]
[""]
[""]
[""]
[""]
[""]
[""]
[""]
[""]
[""]
[""]
[""]
[""]
[""]
[""]
[""]
[""]
[""]
[""]
[""]
[""]
[""]
[""]
[""]
[""]
[""]
[""]
[""]
[""]
[""]
[""]
[""]
[""]
[""]
[""]
[""]
[""]
[""]
[""]
[""]
[""]
[""]
[""]
[""]
[""]
[""]
[""]
[""]
[""]
[""]
[""]
[""]
[""]
[""]
[""]
[""]
[""]
[""]
[""]
[""]
[""]
[""]
[{"$f":"IF(B1285>0,A1284+1,\"\")","v":""}]
[""]
[""]
[""]
[""]
[""]
[""]
[""]
[""]
[""]
[""]
[""]
[""]
[""]
[""]
[""]
[""]
[""]
[""]
[""]
[""]
[""]
[""]
[""]
[""]
[""]
[""]
[""]
[""]
[""]
[""]
[""]
[""]
[""]
[""]
[""]
[""]
[""]
[""]
[""]
[""]
[""]
[""]
[""]
[""]
[""]
[""]
[""]
[""]
[""]
[""]
[""]
[""]
[""]
[""]
[""]
[""]
[""]
[""]
[""]
[""]
[""]
[""]
[""]
[{"$f":"IF(B1349>0,A1348+1,\"\")","v":""}]
[""]
[""]
[""]
[""]
[""]
[""]
[""]
[""]
[""]
[""]
[""]
[""]
[""]
[""]
[""]
[""]
[""]
[""]
[""]
[""]
[""]
[""]
[""]
[""]
[""]
[""]
[""]
[""]
[""]
[""]
[""]
[""]
[""]
[""]
[""]
[""]
[""]
[""]
[""]
[""]
[""]
[""]
[""]
[""]
[""]
[""]
[""]
[""]
[""]
[""]
[""]
[""]
[""]
[""]
[""]
[""]
[""]
[""]
[""]
[""]
[""]
[""]
[""]
[{"$f":"IF(B1413>0,A1412+1,\"\")","v":""}]
[""]
[""]
[""]
[""]
[""]
[""]
[""]
[""]
[""]
[""]
[""]
[""]
[""]
[""]
[""]
[""]
[""]
[""]
[""]
[""]
[""]
[""]
[""]
[""]
[""]
[""]
[""]
[""]
[""]
[""]
[""]
[""]
[""]
[""]
[""]
[""]
[""]
[""]
[""]
[""]
[""]
[""]
[""]
[""]
[""]
[""]
[""]
[""]
[""]
[""]
[""]
[""]
[""]
[""]
[""]
[""]
[""]
[""]
[""]
[""]
[""]
[""]
[""]
[{"$f":"IF(B1477>0,A1476+1,\"\")","v":""}]
[""]
[""]
[""]
[""]
[""]
[""]
[""]
[""]
[""]
[""]
[""]
[""]
[""]
[""]
[""]
[""]
[""]
[""]
[""]
[""]
[""]
[""]
[""]
[""]
[""]
[""]
[""]
[""]
[""]
[""]
[""]
[""]
[""]
[""]
[""]
[""]
[""]
[""]
[""]
[""]
[""]
[""]
[""]
[""]
[""]
[""]
[""]
[""]
[""]
[""]
[""]
[""]
[""]
[""]
[""]
[""]
[""]
[""]
[""]
[""]
[""]
[""]
[""]
[{"$f":"IF(B1541>0,A1540+1,\"\")","v":""}]
[""]
[""]
[""]
[""]
[""]
[""]
[""]
[""]
[""]
[""]
[""]
[""]
[""]
[""]
[""]
[""]
[""]
[""]
[""]
[""]
[""]
[""]
[""]
[""]
[""]
[""]
[""]
[""]
[""]
[""]
[""]
[""]
[""]
[""]
[""]
[""]
[""]
[""]
[""]
[""]
[""]
[""]
[""]
[""]
[""]
[""]
[""]
[""]
[""]
[""]
[""]
[""]
[""]
[""]
[""]
[""]
[""]
[""]
[""]
[""]
[""]
[""]
[""]
[{"$f":"IF(B1605>0,A1604+1,\"\")","v":""}]
[""]
[""]
[""]
[""]
[""]
[""]
[""]
[""]
[""]
[""]
[""]
[""]
[""]
[""]
[""]
[""]
[""]
[""]
[""]
[""]
[""]
[""]
[""]
[""]
[""]
[""]
[""]
[""]
[""]
[""]
[""]
[""]
[""]
[""]
[""]
[""]
[""]
[""]
[""]
[""]
[""]
[""]
[""]
[""]
[""]
[""]
[""]
[""]
[""]
[""]
[""]
[""]
[""]
[""]
[""]
[""]
[""]
[""]
[""]
[""]
[""]
[""]
[""]
[{"$f":"IF(B1669>0,A1668+1,\"\")","v":""}]
[""]
[""]
[""]
[""]
[""]
[""]
[""]
[""]
[""]
[""]
[""]
[""]
[""]
[""]
[""]
[""]
[""]
[""]
[""]
[""]
[""]
[""]
[""]
[""]
[""]
[""]
[""]
[""]
[""]
[""]
[""]
[""]
[""]
[""]
[""]
[""]
[""]
[""]
[""]
[""]
[""]
[""]
[""]
[""]
[""]
[""]
[""]
[""]
[""]
[""]
[""]
[""]
[""]
[""]
[""]
[""]
[""]
[""]
[""]
[""]
[""]
[""]
[""]
[{"$f":"IF(B1733>0,A1732+1,\"\")","v":""}]
[""]
[""]
[""]
[""]
[""]
[""]
[""]
[""]
[""]
[""]
[""]
[""]
[""]
[""]
[""]
[""]
[""]
[""]
[""]
[""]
[""]
[""]
[""]
[""]
[""]
[""]
[""]
[""]
[""]
[""]
[""]
[""]
[""]
[""]
[""]
[""]
[""]
[""]
[""]
[""]
[""]
[""]
[""]
[""]
[""]
[""]
[""]
[""]
[""]
[""]
[""]
[""]
[""]
[""]
[""]
[""]
[""]
[""]
[""]
[""]
[""]
[""]
[""]
[{"$f":"IF(B1797>0,A1796+1,\"\")","v":""}]
[""]
[""]
[""]
[""]
[""]
[""]
[""]
[""]
[""]
[""]
[""]
[""]
[""]
[""]
[""]
[""]
[""]
[""]
[""]
[""]
[""]
[""]
[""]
[""]
[""]
[""]
[""]
[""]
[""]
[""]
[""]
[""]
[""]
[""]
[""]
[""]
[""]
[""]
[""]
[""]
[""]
[""]
[""]
[""]
[""]
[""]
[""]
[""]
[""]
[""]
[""]
[""]
[""]
[""]
[""]
[""]
[""]
[""]
[""]
[""]
[""]
[""]
[""]
[{"$f":"IF(B1861>0,A1860+1,\"\")","v":""}]
[""]
[""]
[""]
[""]
[""]
[""]
[""]
[""]
[""]
[""]
[""]
[""]
[""]
[""]
[""]
[""]
[""]
[""]
[""]
[""]
[""]
[""]
[""]
[""]
[""]
[""]
[""]
[""]
[""]
[""]
[""]
[""]
[""]
[""]
[""]
[""]
[""]
[""]
[""]
[""]
[""]
[""]
[""]
[""]
[""]
[""]
[""]
[""]
[""]
[""]
[""]
[""]
[""]
[""]
[""]
[""]
[""]
[""]
[""]
[""]
[""]
[""]
[""]
[{"$f":"IF(B1925>0,A1924+1,\"\")","v":""}]
[""]
[""]
[""]
[""]
[""]
[""]
[""]
[""]
[""]
[""]
[""]
[""]
[""]
[""]
[""]
[""]
[""]
[""]
[""]
[""]
[""]
[""]
[""]
[""]
[""]
[""]
[""]
[""]
[""]
[""]
[""]
[""]
[""]
[""]
[""]
[""]
[""]
[""]
[""]
[""]
[""]
[""]
[""]
[""]
[""]
[""]
[""]
[""]
[""]
[""]
[""]
[""]
[""]
[""]
[""]
[""]
[""]
[""]
[""]
[""]
[""]
[""]
[""]
[{"$f":"IF(B1989>0,A1988+1,\"\")","v":""}]
[""]
[""]
[""]
[""]
[""]
[""]
[""]
[""]
[""]
[""]
[""]
[""]
[""]
[""]
[""]
[""]
[""]
[""]
[""]
[""]
[""]
[""]
[""]
[""]
[""]
[""]
[""]
[""]
[""]
[""]
[""]
[""]
[""]
[""]
[""]
[""]
[""]
[""]
[""]
[""]
[""]
[""]
[""]
[""]
[""]
[""]
[""]
[""]
[""]
[""]
[""]
[""]
[""]
[""]
[""]
[""]
[""]
[""]
[""]
[""]
[""]
[""]
[""]
[{"$f":"IF(B2053>0,A2052+1,\"\")","v":""}]
[""]
[""]
[""]
[""]
[""]
[""]
[""]
[""]
[""]
[""]
[""]
[""]
[""]
[""]
[""]
[""]
[""]
[""]
[""]
[""]
[""]
[""]
[""]
[""]
[""]
[""]
[""]
[""]
[""]
[""]
[""]
[""]
[""]
[""]
[""]
[""]
[""]
[""]
[""]
[""]
[""]
[""]
[""]
[""]
[""]
[""]
[""]
[""]
[""]
[""]
[""]
[""]
[""]
[""]
[""]
[""]
[""]
[""]
[""]
[""]
[""]
[""]
[""]
[{"$f":"IF(B2117>0,A2116+1,\"\")","v":""}]
[""]
[""]
[""]
[""]
[""]
[""]
[""]
[""]
[""]
[""]
[""]
[""]
[""]
[""]
[""]
[""]
[""]
[""]
[""]
[""]
[""]
[""]
[""]
[""]
[""]
[""]
[""]
[""]
[""]
[""]
[""]
[""]
[""]
[""]
[""]
[""]
[""]
[""]
[""]
[""]
[""]
[""]
[""]
[""]
[""]
[""]
[""]
[""]
[""]
[""]
[""]
[""]
[""]
[""]
[""]
[""]
[""]
[""]
[""]
[""]
[""]
[""]
[""]
[{"$f":"IF(B2181>0,A2180+1,\"\")","v":""}]
[""]
[""]
[""]
[""]
[""]
[""]
[""]
[""]
[""]
[""]
[""]
[""]
[""]
[""]
[""]
[""]
[""]
[""]
[""]
[""]
[""]
[""]
[""]
[""]
[""]
[""]
[""]
[""]
[""]
[""]
[""]
[""]
[""]
[""]
[""]
[""]
[""]
[""]
[""]
[""]
[""]
[""]
[""]
[""]
[""]
[""]
[""]
[""]
[""]
[""]
[""]
[""]
[""]
[""]
[""]
[""]
[""]
[""]
[""]
[""]
[""]
[""]
[""]
[{"$f":"IF(B2245>0,A2244+1,\"\")","v":""}]
[""]
[""]
[""]
[""]
[""]
[""]
[""]
[""]
[""]
[""]
[""]
[""]
[""]
[""]
[""]
[""]
[""]
[""]
[""]
[""]
[""]
[""]
[""]
[""]
[""]
[""]
[""]
[""]
[""]
[""]
[""]
[""]
[""]
[""]
[""]
[""]
[""]
[""]
[""]
[""]
[""]
[""]
[""]
[""]
[""]
[""]
[""]
[""]
[""]
[""]
[""]
[""]
[""]
[""]
[""]
[""]
[""]
[""]
[""]
[""]
[""]
[""]
[""]
[{"$f":"IF(B2309>0,A2308+1,\"\")","v":""}]
[""]
[""]
[""]
[""]
[""]
[""]
[""]
[""]
[""]
[""]
[""]
[""]
[""]
[""]
[""]
[""]
[""]
[""]
[""]
[""]
[""]
[""]
[""]
[""]
[""]
[""]
[""]
[""]
[""]
[""]
[""]
[""]
[""]
[""]
[""]
[""]
[""]
[""]
[""]
[""]
[""]
[""]
[""]
[""]
[""]
[""]
[""]
[""]
[""]
[""]
[""]
[""]
[""]
[""]
[""]
[""]
[""]
[""]
[""]
[""]
[""]
[""]
[""]
[{"$f":"IF(B2373>0,A2372+1,\"\")","v":""}]
[""]
[""]
[""]
[""]
[""]
[""]
[""]
[""]
[""]
[""]
[""]
[""]
[""]
[""]
[""]
[""]
[""]
[""]
[""]
[""]
[""]
[""]
[""]
[""]
[""]
[""]
[""]
[""]
[""]
[""]
[""]
[""]
[""]
[""]
[""]
[""]
[""]
[""]
[""]
[""]
[""]
[""]
[""]
[""]
[""]
[""]
[""]
[""]
[""]
[""]
[""]
[""]
[""]
[""]
[""]
[""]
[""]
[""]
[""]
[""]
[""]
[""]
[""]
[{"$f":"IF(B2437>0,A2436+1,\"\")","v":""}]
[""]
[""]
[""]
[""]
[""]
[""]
[""]
[""]
[""]
[""]
[""]
[""]
[""]
[""]
[""]
[""]
[""]
[""]
[""]
[""]
[""]
[""]
[""]
[""]
[""]
[""]
[""]
[""]
[""]
[""]
[""]
[""]
[""]
[""]
[""]
[""]
[""]
[""]
[""]
[""]
[""]
[""]
[""]
[""]
[""]
[""]
[""]
[""]
[""]
[""]
[""]
[""]
[""]
[""]
[""]
[""]
[""]
[""]
[""]
[""]
[""]
[""]
[""]
[{"$f":"IF(B2501>0,A2500+1,\"\")","v":""}]
[""]
[""]
[""]
[""]
[""]
[""]
[""]
[""]
[""]
[""]
[""]
[""]
[""]
[""]
[""]
[""]
[""]
[""]
[""]
[""]
[""]
[""]
[""]
[""]
[""]
[""]
[""]
[""]
[""]
[""]
[""]
[""]
[""]
[""]
[""]
[""]
[""]
[""]
[""]
[""]
[""]
[""]
[""]
[""]
[""]
[""]
[""]
[""]
[""]
[""]
[""]
[""]
[""]
[""]
[""]
[""]
[""]
[""]
[""]
[""]
[""]
[""]
[""]
[{"$f":"IF(B2565>0,A2564+1,\"\")","v":""}]
[""]
[""]
[""]
[""]
[""]
[""]
[""]
[""]
[""]
[""]
[""]
[""]
[""]
[""]
[""]
[""]
[""]
[""]
[""]
[""]
[""]
[""]
[""]
[""]
[""]
[""]
[""]
[""]
[""]
[""]
[""]
[""]
[""]
[""]
[""]
[""]
[""]
[""]
[""]
[""]
[""]
[""]
[""]
[""]
[""]
[""]
[""]
[""]
[""]
[""]
[""]
[""]
[""]
[""]
[""]
[""]
[""]
[""]
[""]
[""]
[""]
[""]
[""]
[{"$f":"IF(B2629>0,A2628+1,\"\")","v":""}]
[""]
[""]
[""]
[""]
[""]
[""]
[""]
[""]
[""]
[""]
[""]
[""]
[""]
[""]
[""]
[""]
[""]
[""]
[""]
[""]
[""]
[""]
[""]
[""]
[""]
[""]
[""]
[""]
[""]
[""]
[""]
[""]
[""]
[""]
[""]
[""]
[""]
[""]
[""]
[""]
[""]
[""]
[""]
[""]
[""]
[""]
[""]
[""]
[""]
[""]
[""]
[""]
[""]
[""]
[""]
[""]
[""]
[""]
[""]
[""]
[""]
[""]
[""]
[{"$f":"IF(B2693>0,A2692+1,\"\")","v":""}]
[""]
[""]
[""]
[""]
[""]
[""]
[""]
[""]
[""]
[""]
[""]
[""]
[""]
[""]
[""]
[""]
[""]
[""]
[""]
[""]
[""]
[""]
[""]
[""]
[""]
[""]
[""]
[""]
[""]
[""]
[""]
[""]
[""]
[""]
[""]
[""]
[""]
[""]
[""]
[""]
[""]
[""]
[""]
[""]
[""]
[""]
[""]
[""]
[""]
[""]
[""]
[""]
[""]
[""]
[""]
[""]
[""]
[""]
[""]
[""]
[""]
[""]
[""]
[{"$f":"IF(B2757>0,A2756+1,\"\")","v":""}]
[""]
[""]
[""]
[""]
[""]
[""]
[""]
[""]
[""]
[""]
[""]
[""]
[""]
[""]
[""]
[""]
[""]
[""]
[""]
[""]
[""]
[""]
[""]
[""]
[""]
[""]
[""]
[""]
[""]
[""]
[""]
[""]
[""]
[""]
[""]
[""]
[""]
[""]
[""]
[""]
[""]
[""]
[""]
[""]
[""]
[""]
[""]
[""]
[""]
[""]
[""]
[""]
[""]
[""]
[""]
[""]
[""]
[""]
[""]
[""]
[""]
[""]
[""]
[{"$f":"IF(B2821>0,A2820+1,\"\")","v":""}]
[""]
[""]
[""]
[""]
[""]
[""]
[""]
[""]
[""]
[""]
[""]
[""]
[""]
[""]
[""]
[""]
[""]
[""]
[""]
[""]
[""]
[""]
[""]
[""]
[""]
[""]
[""]
[""]
[""]
[""]
[""]
[""]
[""]
[""]
[""]
[""]
[""]
[""]
[""]
[""]
[""]
[""]
[""]
[""]
[""]
[""]
[""]
[""]
[""]
[""]
[""]
[""]
[""]
[""]
[""]
[""]
[""]
[""]
[""]
[""]
[""]
[""]
[""]
[{"$f":"IF(B2885>0,A2884+1,\"\")","v":""}]
[""]
[""]
[""]
[""]
[""]
[""]
[""]
[""]
[""]
[""]
[""]
[""]
[""]
[""]
[""]
[""]
[""]
[""]
[""]
[""]
[""]
[""]
[""]
[""]
[""]
[""]
[""]
[""]
[""]
[""]
[""]
[""]
[""]
[""]
[""]
[""]
[""]
[""]
[""]
[""]
[""]
[""]
[""]
[""]
[""]
[""]
[""]
[""]
[""]
[""]
[""]
[""]
[""]
[""]
[""]
[""]
[""]
[""]
[""]
[""]
[""]
[""]
[""]
[{"$f":"IF(B2949>0,A2948+1,\"\")","v":""}]
[""]
[""]
[""]
[""]
[""]
[""]
[""]
[""]
[""]
[""]
[""]
[""]
[""]
[""]
[""]
[""]
[""]
[""]
[""]
[""]
[""]
[""]
[""]
[""]
[""]
[""]
[""]
[""]
[""]
[""]
[""]
[""]
[""]
[""]
[""]
[""]
[""]
[""]
[""]
[""]
[""]
[""]
[""]
[""]
[""]
[""]
[""]
[""]
[""]
[""]
[""]
[""]
[""]
[""]
[""]
[""]
[""]
[""]
[""]
[""]
[""]
[""]
[""]
[{"$f":"IF(B3013>0,A3012+1,\"\")","v":""}]
[""]
[""]
[""]
[""]
[""]
[""]
[""]
[""]
[""]
[""]
[""]
[""]
[""]
[""]
[""]
[""]
[""]
[""]
[""]
[""]
[""]
[""]
[""]
[""]
[""]
[""]
[""]
[""]
[""]
[""]
[""]
[""]
[""]
[""]
[""]
[""]
[""]
[""]
[""]
[""]
[""]
[""]
[""]
[""]
[""]
[""]
[""]
[""]
[""]
[""]
[""]
[""]
[""]
[""]
[""]
[""]
[""]
[""]
[""]
[""]
[""]
[""]
[""]
[{"$f":"IF(B3077>0,A3076+1,\"\")","v":""}]
[""]
[""]
[""]
[""]
[""]
[""]
[""]
[""]
[""]
[""]
[""]
[""]
[""]
[""]
[""]
[""]
[""]
[""]
[""]
[""]
[""]
[""]
[""]
[""]
[""]
[""]
[""]
[""]
[""]
[""]
[""]
[""]
[""]
[""]
[""]
[""]
[""]
[""]
[""]
[""]
[""]
[""]
[""]
[""]
[""]
[""]
[""]
[""]
[""]
[""]
[""]
[""]
[""]
[""]
[""]
[""]
[""]
[""]
[""]
[""]
[""]
[""]
[""]
[{"$f":"IF(B3141>0,A3140+1,\"\")","v":""}]
[""]
[""]
[""]
[""]
[""]
[""]
[""]
[""]
[""]
[""]
[""]
[""]
[""]
[""]
[""]
[""]
[""]
[""]
[""]
[""]
[""]
[""]
[""]
[""]
[""]
[""]
[""]
[""]
[""]
[""]
[""]
[""]
[""]
[""]
[""]
[""]
[""]
[""]
[""]
[""]
[""]
[""]
[""]
[""]
[""]
[""]
[""]
[""]
[""]
[""]
[""]
[""]
[""]
[""]
[""]
[""]
[""]
[""]
[""]
[""]
[""]
[""]
[""]
[{"$f":"IF(B3205>0,A3204+1,\"\")","v":""}]
[""]
[""]
[""]
[""]
[""]
[""]
[""]
[""]
[""]
[""]
[""]
[""]
[""]
[""]
[""]
[""]
[""]
[""]
[""]
[""]
[""]
[""]
[""]
[""]
[""]
[""]
[""]
[""]
[""]
[""]
[""]
[""]
[""]
[""]
[""]
[""]
[""]
[""]
[""]
[""]
[""]
[""]
[""]
[""]
[""]
[""]
[""]
[""]
[""]
[""]
[""]
[""]
[""]
[""]
[""]
[""]
[""]
[""]
[""]
[""]
[""]
[""]
[""]
[{"$f":"IF(B3269>0,A3268+1,\"\")","v":""}]
[""]
[""]
[""]
[""]
[""]
[""]
[""]
[""]
[""]
[""]
[""]
[""]
[""]
[""]
[""]
[""]
[""]
[""]
[""]
[""]
[""]
[""]
[""]
[""]
[""]
[""]
[""]
[""]
[""]
[""]
[""]
[""]
[""]
[""]
[""]
[""]
[""]
[""]
[""]
[""]
[""]
[""]
[""]
[""]
[""]
[""]
[""]
[""]
[""]
[""]
[""]
[""]
[""]
[""]
[""]
[""]
[""]
[""]
[""]
[""]
[""]
[""]
[""]
[{"$f":"IF(B3333>0,A3332+1,\"\")","v":""}]
[""]
[""]
[""]
[""]
[""]
[""]
[""]
[""]
[""]
[""]
[""]
[""]
[""]
[""]
[""]
[""]
[""]
[""]
[""]
[""]
[""]
[""]
[""]
[""]
[""]
[""]
[""]
[""]
[""]
[""]
[""]
[""]
[""]
[""]
[""]
[""]
[""]
[""]
[""]
[""]
[""]
[""]
[""]
[""]
[""]
[""]
[""]
[""]
[""]
[""]
[""]
[""]
[""]
[""]
[""]
[""]
[""]
[""]
[""]
[""]
[""]
[""]
[""]
[{"$f":"IF(B3397>0,A3396+1,\"\")","v":""}]
[""]
[""]
[""]
[""]
[""]
[""]
[""]
[""]
[""]
[""]
[""]
[""]
[""]
[""]
[""]
[""]
[""]
[""]
[""]
[""]
[""]
[""]
[""]
[""]
[""]
[""]
[""]
[""]
[""]
[""]
[""]
[""]
[""]
[""]
[""]
[""]
[""]
[""]
[""]
[""]
[""]
[""]
[""]
[""]
[""]
[""]
[""]
[""]
[""]
[""]
[""]
[""]
[""]
[""]
[""]
[""]
[""]
[""]
[""]
[""]
[""]
[""]
[""]
[{"$f":"IF(B3461>0,A3460+1,\"\")","v":""}]
[""]
[""]
[""]
[""]
[""]
[""]
[""]
[""]
[""]
[""]
[""]
[""]
[""]
[""]
[""]
[""]
[""]
[""]
[""]
[""]
[""]
[""]
[""]
[""]
[""]
[""]
[""]
[""]
[""]
[""]
[""]
[""]
[""]
[""]
[""]
[""]
[""]
[""]
[""]
[""]
[""]
[""]
[""]
[""]
[""]
[""]
[""]
[""]
[""]
[""]
[""]
[""]
[""]
[""]
[""]
[""]
[""]
[""]
[""]
[""]
[""]
[""]
[""]
[{"$f":"IF(B3525>0,A3524+1,\"\")","v":""}]
[""]
[""]
[""]
[""]
[""]
[""]
[""]
[""]
[""]
[""]
[""]
[""]
[""]
[""]
[""]
[""]
[""]
[""]
[""]
[""]
[""]
[""]
[""]
[""]
[""]
[""]
[""]
[""]
[""]
[""]
[""]
[""]
[""]
[""]
[""]
[""]
[""]
[""]
[""]
[""]
[""]
[""]
[""]
[""]
[""]
[""]
[""]
[""]
[""]
[""]
[""]
[""]
[""]
[""]
[""]
[""]
[""]
[""]
[""]
[""]
[""]
[""]
[""]
[{"$f":"IF(B3589>0,A3588+1,\"\")","v":""}]
[""]
[""]
[""]
[""]
[""]
[""]
[""]
[""]
[""]
[""]
[""]
[""]
[""]
[""]
[""]
[""]
[""]
[""]
[""]
[""]
[""]
[""]
[""]
[""]
[""]
[""]
[""]
[""]
[""]
[""]
[""]
[""]
[""]
[""]
[""]
[""]
[""]
[""]
[""]
[""]
[""]
[""]
[""]
[""]
[""]
[""]
[""]
[""]
[""]
[""]
[""]
[""]
[""]
[""]
[""]
[""]
[""]
[""]
[""]
[""]
[""]
[""]
[""]
[{"$f":"IF(B3653>0,A3652+1,\"\")","v":""}]
[""]
[""]
[""]
[""]
[""]
[""]
[""]
[""]
[""]
[""]
[""]
[""]
[""]
[""]
[""]
[""]
[""]
[""]
[""]
[""]
[""]
[""]
[""]
[""]
[""]
[""]
[""]
[""]
[""]
[""]
[""]
[""]
[""]
[""]
[""]
[""]
[""]
[""]
[""]
[""]
[""]
[""]
[""]
[""]
[""]
[""]
[""]
[""]
[""]
[""]
[""]
[""]
[""]
[""]
[""]
[""]
[""]
[""]
[""]
[""]
[""]
[""]
[""]
[{"$f":"IF(B3717>0,A3716+1,\"\")","v":""}]
[""]
[""]
[""]
[""]
[""]
[""]
[""]
[""]
[""]
[""]
[""]
[""]
[""]
[""]
[""]
[""]
[""]
[""]
[""]
[""]
[""]
[""]
[""]
[""]
[""]
[""]
[""]
[""]
[""]
[""]
[""]
[""]
[""]
[""]
[""]
[""]
[""]
[""]
[""]
[""]
[""]
[""]
[""]
[""]
[""]
[""]
[""]
[""]
[""]
[""]
[""]
[""]
[""]
[""]
[""]
[""]
[""]
[""]
[""]
[""]
[""]
[""]
[""]
[{"$f":"IF(B3781>0,A3780+1,\"\")","v":""}]
[""]
[""]
[""]
[""]
[""]
[""]
[""]
[""]
[""]
[""]
[""]
[""]
[""]
[""]
[""]
[""]
[""]
[""]
[""]
[""]
[""]
[""]
[""]
[""]
[""]
[""]
[""]
[""]
[""]
[""]
[""]
[""]
[""]
[""]
[""]
[""]
[""]
[""]
[""]
[""]
[""]
[""]
[""]
[""]
[""]
[""]
[""]
[""]
[""]
[""]
[""]
[""]
[""]
[""]
[""]
[""]
[""]
[""]
[""]
[""]
[""]
[""]
[""]
[{"$f":"IF(B3845>0,A3844+1,\"\")","v":""}]
[""]
[""]
[""]
[""]
[""]
[""]
[""]
[""]
[""]
[""]
[""]
[""]
[""]
[""]
[""]
[""]
[""]
[""]
[""]
[""]
[""]
[""]
[""]
[""]
[""]
[""]
[""]
[""]
[""]
[""]
[""]
[""]
[""]
[""]
[""]
[""]
[""]
[""]
[""]
[""]
[""]
[""]
[""]
[""]
[""]
[""]
[""]
[""]
[""]
[""]
[""]
[""]
[""]
[""]
[""]
[""]
[""]
[""]
[""]
[""]
[""]
[""]
[""]
[{"$f":"IF(B3909>0,A3908+1,\"\")","v":""}]
[""]
[""]
[""]
[""]
[""]
[""]
[""]
[""]
[""]
[""]
[""]
[""]
[""]
[""]
[""]
[""]
[""]
[""]
[""]
[""]
[""]
[""]
[""]
[""]
[""]
[""]
[""]
[""]
[""]
[""]
[""]
[""]
[""]
[""]
[""]
[""]
[""]
[""]
[""]
[""]
[""]
[""]
[""]
[""]
[""]
[""]
[""]
[""]
[""]
[""]
[""]
[""]
[""]
[""]
[""]
[""]
[""]
[""]
[""]
[""]
[""]
[""]
[""]
[{"$f":"IF(B3973>0,A3972+1,\"\")","v":""}]
[""]
[""]
[""]
[""]
[""]
[""]
[""]
[""]
[""]
[""]
[""]
[""]
[""]
[""]
[""]
[""]
[""]
[""]
[""]
[""]
[""]
[""]
[""]
[""]
[""]
[""]
[""]
[""]
[""]
[""]
[""]
[""]
[""]
[""]
[""]
[""]
[""]
[""]
[""]
[""]
[""]
[""]
[""]
[""]
[""]
[""]
[""]
[""]
[""]
[""]
[""]
[""]
[""]
[""]
[""]
[""]
[""]
[""]
[""]
[""]
[""]
[""]
[""]
[{"$f":"IF(B4037>0,A4036+1,\"\")","v":""}]
[""]
[""]
[""]
[""]
[""]
[""]
[""]
[""]
[""]
[""]
[""]
[""]
[""]
[""]
[""]
[""]
[""]
[""]
[""]
[""]
[""]
[""]
[""]
[""]
[""]
[""]
[""]
[""]
[""]
[""]
[""]
[""]
[""]
[""]
[""]
[""]
[""]
[""]
[""]
[""]
[""]
[""]
[""]
[""]
[""]
[""]
[""]
[""]
[""]
[""]
[""]
[""]
[""]
[""]
[""]
[""]
[""]
[""]
[""]
[""]
[""]
[""]
[""]
[{"$f":"IF(B4101>0,A4100+1,\"\")","v":""}]
[""]
[""]
[""]
[""]
[""]
[""]
[""]
[""]
[""]
[""]
[""]
[""]
[""]
[""]
[""]
[""]
[""]
[""]
[""]
[""]
[""]
[""]
[""]
[""]
[""]
[""]
[""]
[""]
[""]
[""]
[""]
[""]
[""]
[""]
[""]
[""]
[""]
[""]
[""]
[""]
[""]
[""]
[""]
[""]
[""]
[""]
[""]
[""]
[""]
[""]
[""]
[""]
[""]
[""]
[""]
[""]
[""]
[""]
[""]
[""]
[""]
[""]
[""]
[{"$f":"IF(B4165>0,A4164+1,\"\")","v":""}]
[""]
[""]
[""]
[""]
[""]
[""]
[""]
[""]
[""]
[""]
[""]
[""]
[""]
[""]
[""]
[""]
[""]
[""]
[""]
[""]
[""]
[""]
[""]
[""]
[""]
[""]
[""]
[""]
[""]
[""]
[""]
[""]
[""]
[""]
[""]
[""]
[""]
[""]
[""]
[""]
[""]
[""]
[""]
[""]
[""]
[""]
[""]
[""]
[""]
[""]
[""]
[""]
[""]
[""]
[""]
[""]
[""]
[""]
[""]
[""]
[""]
[""]
[""]
[{"$f":"IF(B4229>0,A4228+1,\"\")","v":""}]
[""]
[""]
[""]
[""]
[""]
[""]
[""]
[""]
[""]
[""]
[""]
[""]
[""]
[""]
[""]
[""]
[""]
[""]
[""]
[""]
[""]
[""]
[""]
[""]
[""]
[""]
[""]
[""]
[""]
[""]
[""]
[""]
[""]
[""]
[""]
[""]
[""]
[""]
[""]
[""]
[""]
[""]
[""]
[""]
[""]
[""]
[""]
[""]
[""]
[""]
[""]
[""]
[""]
[""]
[""]
[""]
[""]
[""]
[""]
[""]
[""]
[""]
[""]
[{"$f":"IF(B4293>0,A4292+1,\"\")","v":""}]
[""]
[""]
[""]
[""]
[""]
[""]
[""]
[""]
[""]
[""]
[""]
[""]
[""]
[""]
[""]
[""]
[""]
[""]
[""]
[""]
[""]
[""]
[""]
[""]
[""]
[""]
[""]
[""]
[""]
[""]
[""]
[""]
[""]
[""]
[""]
[""]
[""]
[""]
[""]
[""]
[""]
[""]
[""]
[""]
[""]
[""]
[""]
[""]
[""]
[""]
[""]
[""]
[""]
[""]
[""]
[""]
[""]
[""]
[""]
[""]
[""]
[""]
[""]
[{"$f":"IF(B4357>0,A4356+1,\"\")","v":""}]
[""]
[""]
[""]
[""]
[""]
[""]
[""]
[""]
[""]
[""]
[""]
[""]
[""]
[""]
[""]
[""]
[""]
[""]
[""]
[""]
[""]
[""]
[""]
[""]
[""]
[""]
[""]
[""]
[""]
[""]
[""]
[""]
[""]
[""]
[""]
[""]
[""]
[""]
[""]
[""]
[""]
[""]
[""]
[""]
[""]
[""]
[""]
[""]
[""]
[""]
[""]
[""]
[""]
[""]
[""]
[""]
[""]
[""]
[""]
[""]
[""]
[""]
[""]
[{"$f":"IF(B4421>0,A4420+1,\"\")","v":""}]
[""]
[""]
[""]
[""]
[""]
[""]
[""]
[""]
[""]
[""]
[""]
[""]
[""]
[""]
[""]
[""]
[""]
[""]
[""]
[""]
[""]
[""]
[""]
[""]
[""]
[""]
[""]
[""]
[""]
[""]
[""]
[""]
[""]
[""]
[""]
[""]
[""]
[""]
[""]
[""]
[""]
[""]
[""]
[""]
[""]
[""]
[""]
[""]
[""]
[""]
[""]
[""]
[""]
[""]
[""]
[""]
[""]
[""]
[""]
[""]
[""]
[""]
[""]
[{"$f":"IF(B4485>0,A4484+1,\"\")","v":""}]
[""]
[""]
[""]
[""]
[""]
[""]
[""]
[""]
[""]
[""]
[""]
[""]
[""]
[""]
[""]
[""]
[""]
[""]
[""]
[""]
[""]
[""]
[""]
[""]
[""]
[""]
[""]
[""]
[""]
[""]
[""]
[""]
[""]
[""]
[""]
[""]
[""]
[""]
[""]
[""]
[""]
[""]
[""]
[""]
[""]
[""]
[""]
[""]
[""]
[""]
[""]
[""]
[""]
[""]
[""]
[""]
[""]
[""]
[""]
[""]
[""]
[""]
[""]
[{"$f":"IF(B4549>0,A4548+1,\"\")","v":""}]
[""]
[""]
[""]
[""]
[""]
[""]
[""]
[""]
[""]
[""]
[""]
[""]
[""]
[""]
[""]
[""]
[""]
[""]
[""]
[""]
[""]
[""]
[""]
[""]
[""]
[""]
[""]
[""]
[""]
[""]
[""]
[""]
[""]
[""]
[""]
[""]
[""]
[""]
[""]
[""]
[""]
[""]
[""]
[""]
[""]
[""]
[""]
[""]
[""]
[""]
[""]
[""]
[""]
[""]
[""]
[""]
[""]
[""]
[""]
[""]
[""]
[""]
[""]
[{"$f":"IF(B4613>0,A4612+1,\"\")","v":""}]
[""]
[""]
[""]
[""]
[""]
[""]
[""]
[""]
[""]
[""]
[""]
[""]
[""]
[""]
[""]
[""]
[""]
[""]
[""]
[""]
[""]
[""]
[""]
[""]
[""]
[""]
[""]
[""]
[""]
[""]
[""]
[""]
[""]
[""]
[""]
[""]
[""]
[""]
[""]
[""]
[""]
[""]
[""]
[""]
[""]
[""]
[""]
[""]
[""]
[""]
[""]
[""]
[""]
[""]
[""]
[""]
[""]
[""]
[""]
[""]
[""]
[""]
[""]
[{"$f":"IF(B4677>0,A4676+1,\"\")","v":""}]
[""]
[""]
[""]
[""]
[""]
[""]
[""]
[""]
[""]
[""]
[""]
[""]
[""]
[""]
[""]
[""]
[""]
[""]
[""]
[""]
[""]
[""]
[""]
[""]
[""]
[""]
[""]
[""]
[""]
[""]
[""]
[""]
[""]
[""]
[""]
[""]
[""]
[""]
[""]
[""]
[""]
[""]
[""]
[""]
[""]
[""]
[""]
[""]
[""]
[""]
[""]
[""]
[""]
[""]
[""]
[""]
[""]
[""]
[""]
[""]
[""]
[""]
[""]
[{"$f":"IF(B4741>0,A4740+1,\"\")","v":""}]
[""]
[""]
[""]
[""]
[""]
[""]
[""]
[""]
[""]
[""]
[""]
[""]
[""]
[""]
[""]
[""]
[""]
[""]
[""]
[""]
[""]
[""]
[""]
[""]
[""]
[""]
[""]
[""]
[""]
[""]
[""]
[""]
[""]
[""]
[""]
[""]
[""]
[""]
[""]
[""]
[""]
[""]
[""]
[""]
[""]
[""]
[""]
[""]
[""]
[""]
[""]
[""]
[""]
[""]
[""]
[""]
[""]
[""]
[""]
[""]
[""]
[""]
[""]
[{"$f":"IF(B4805>0,A4804+1,\"\")","v":""}]
[""]
[""]
[""]
[""]
[""]
[""]
[""]
[""]
[""]
[""]
[""]
[""]
[""]
[""]
[""]
[""]
[""]
[""]
[""]
[""]
[""]
[""]
[""]
[""]
[""]
[""]
[""]
[""]
[""]
[""]
[""]
[""]
[""]
[""]
[""]
[""]
[""]
[""]
[""]
[""]
[""]
[""]
[""]
[""]
[""]
[""]
[""]
[""]
[""]
[""]
[""]
[""]
[""]
[""]
[""]
[""]
[""]
[""]
[""]
[""]
[""]
[""]
[""]
[{"$f":"IF(B4869>0,A4868+1,\"\")","v":""}]
[""]
[""]
[""]
[""]
[""]
[""]
[""]
[""]
[""]
[""]
[""]
[""]
[""]
[""]
[""]
[""]
[""]
[""]
[""]
[""]
[""]
[""]
[""]
[""]
[""]
[""]
[""]
[""]
[""]
[""]
[""]
[""]
[""]
[""]
[""]
[""]
[""]
[""]
[""]
[""]
[""]
[""]
[""]
[""]
[""]
[""]
[""]
[""]
[""]
[""]
[""]
[""]
[""]
[""]
[""]
[""]
[""]
[""]
[""]
[""]
[""]
[""]
[""]
[{"$f":"IF(B4933>0,A4932+1,\"\")","v":""}]
[""]
[""]
[""]
[""]
[""]
[""]
[""]
[""]
[""]
[""]
[""]
[""]
[""]
[""]
[""]
[""]
[""]
[""]
[""]
[""]
[""]
[""]
[""]
[""]
[""]
[""]
[""]
[""]
[""]
[""]
[""]
[""]
[""]
[""]
[""]
[""]
[""]
[""]
[""]
[""]
[""]
[""]
[""]
[""]
[""]
[""]
[""]
[""]
[""]
[""]
[""]
[""]
[""]
[""]
[""]
[""]
[""]
[""]
[""]
[""]
[""]
[""]
[""]
[{"$f":"IF(B4997>0,A4996+1,\"\")","v":""}]
[""]
[""]
[""]
[""]
[""]
[""]
[""]
[""]
[""]
[""]
[""]
[""]
[""]
[""]
[""]
[""]
[""]
[""]
[""]
[""]
[""]
[""]
[""]
[""]
[""]
[""]
[""]
[""]
[""]
[""]
[""]
[""]
[""]
[""]
[""]
[""]
[""]
[""]
[""]
[""]
[""]
[""]
[""]
[""]
[""]
[""]
[""]
[""]
[""]
[""]
[""]
[""]
[""]
[""]
[""]
[""]
[""]
[""]
[""]
[""]
[""]
[""]
[""]
[{"$f":"IF(B5061>0,A5060+1,\"\")","v":""}]
[""]
[""]
[""]
[""]
[""]
[""]
[""]
[""]
[""]
[""]
[""]
[""]
[""]
[""]
[""]
[""]
[""]
[""]
[""]
[""]
[""]
[""]
[""]
[""]
[""]
[""]
[""]
[""]
[""]
[""]
[""]
[""]
[""]
[""]
[""]
[""]
[""]
[""]
[""]
[""]
[""]
[""]
[""]
[""]
[""]
[""]
[""]
[""]
[""]
[""]
[""]
[""]
[""]
[""]
[""]
[""]
[""]
[""]
[""]
[""]
[""]
[""]
[""]
[{"$f":"IF(B5125>0,A5124+1,\"\")","v":""}]
[""]
[""]
[""]
[""]
[""]
[""]
[""]
[""]
[""]
[""]
[""]
[""]
[""]
[""]
[""]
[""]
[""]
[""]
[""]
[""]
[""]
[""]
[""]
[""]
[""]
[""]
[""]
[""]
[""]
[""]
[""]
[""]
[""]
[""]
[""]
[""]
[""]
[""]
[""]
[""]
[""]
[""]
[""]
[""]
[""]
[""]
[""]
[""]
[""]
[""]
[""]
[""]
[""]
[""]
[""]
[""]
[""]
[""]
[""]
[""]
[""]
[""]
[""]
[{"$f":"IF(B5189>0,A5188+1,\"\")","v":""}]
[""]
[""]
[""]
[""]
[""]
[""]
[""]
[""]
[""]
[""]
[""]
[""]
[""]
[""]
[""]
[""]
[""]
[""]
[""]
[""]
[""]
[""]
[""]
[""]
[""]
[""]
[""]
[""]
[""]
[""]
[""]
[""]
[""]
[""]
[""]
[""]
[""]
[""]
[""]
[""]
[""]
[""]
[""]
[""]
[""]
[""]
[""]
[""]
[""]
[""]
[""]
[""]
[""]
[""]
[""]
[""]
[""]
[""]
[""]
[""]
[""]
[""]
[""]
[{"$f":"IF(B5253>0,A5252+1,\"\")","v":""}]
[""]
[""]
[""]
[""]
[""]
[""]
[""]
[""]
[""]
[""]
[""]
[""]
[""]
[""]
[""]
[""]
[""]
[""]
[""]
[""]
[""]
[""]
[""]
[""]
[""]
[""]
[""]
[""]
[""]
[""]
[""]
[""]
[""]
[""]
[""]
[""]
[""]
[""]
[""]
[""]
[""]
[""]
[""]
[""]
[""]
[""]
[""]
[""]
[""]
[""]
[""]
[""]
[""]
[""]
[""]
[""]
[""]
[""]
[""]
[""]
[""]
[""]
[""]
[{"$f":"IF(B5317>0,A5316+1,\"\")","v":""}]
[""]
[""]
[""]
[""]
[""]
[""]
[""]
[""]
[""]
[""]
[""]
[""]
[""]
[""]
[""]
[""]
[""]
[""]
[""]
[""]
[""]
[""]
[""]
[""]
[""]
[""]
[""]
[""]
[""]
[""]
[""]
[""]
[""]
[""]
[""]
[""]
[""]
[""]
[""]
[""]
[""]
[""]
[""]
[""]
[""]
[""]
[""]
[""]
[""]
[""]
[""]
[""]
[""]
[""]
[""]
[""]
[""]
[""]
[""]
[""]
[""]
[""]
[""]
[{"$f":"IF(B5381>0,A5380+1,\"\")","v":""}]
[""]
[""]
[""]
[""]
[""]
[""]
[""]
[""]
[""]
[""]
[""]
[""]
[""]
[""]
[""]
[""]
[""]
[""]
[""]
[""]
[""]
[""]
[""]
[""]
[""]
[""]
[""]
[""]
[""]
[""]
[""]
[""]
[""]
[""]
[""]
[""]
[""]
[""]
[""]
[""]
[""]
[""]
[""]
[""]
[""]
[""]
[""]
[""]
[""]
[""]
[""]
[""]
[""]
[""]
[""]
[""]
[""]
[""]
[""]
[""]
[""]
[""]
[""]
[{"$f":"IF(B5445>0,A5444+1,\"\")","v":""}]
[""]
[""]
[""]
[""]
[""]
[""]
[""]
[""]
[""]
[""]
[""]
[""]
[""]
[""]
[""]
[""]
[""]
[""]
[""]
[""]
[""]
[""]
[""]
[""]
[""]
[""]
[""]
[""]
[""]
[""]
[""]
[""]
[""]
[""]
[""]
[""]
[""]
[""]
[""]
[""]
[""]
[""]
[""]
[""]
[""]
[""]
[""]
[""]
[""]
[""]
[""]
[""]
[""]
[""]
[""]
[""]
[""]
[""]
[""]
[""]
[""]
[""]
[""]
[{"$f":"IF(B5509>0,A5508+1,\"\")","v":""}]
[""]
[""]
[""]
[""]
[""]
[""]
[""]
[""]
[""]
[""]
[""]
[""]
[""]
[""]
[""]
[""]
[""]
[""]
[""]
[""]
[""]
[""]
[""]
[""]
[""]
[""]
[""]
[""]
[""]
[""]
[""]
[""]
[""]
[""]
[""]
[""]
[""]
[""]
[""]
[""]
[""]
[""]
[""]
[""]
[""]
[""]
[""]
[""]
[""]
[""]
[""]
[""]
[""]
[""]
[""]
[""]
[""]
[""]
[""]
[""]
[""]
[""]
[""]
[{"$f":"IF(B5573>0,A5572+1,\"\")","v":""}]
[""]
[""]
[""]
[""]
[""]
[""]
[""]
[""]
[""]
[""]
[""]
[""]
[""]
[""]
[""]
[""]
[""]
[""]
[""]
[""]
[""]
[""]
[""]
[""]
[""]
[""]
[""]
[""]
[""]
[""]
[""]
[""]
[""]
[""]
[""]
[""]
[""]
[""]
[""]
[""]
[""]
[""]
[""]
[""]
[""]
[""]
[""]
[""]
[""]
[""]
[""]
[""]
[""]
[""]
[""]
[""]
[""]
[""]
[""]
[""]
[""]
[""]
[""]
[{"$f":"IF(B5637>0,A5636+1,\"\")","v":""}]
[""]
[""]
[""]
[""]
[""]
[""]
[""]
[""]
[""]
[""]
[""]
[""]
[""]
[""]
[""]
[""]
[""]
[""]
[""]
[""]
[""]
[""]
[""]
[""]
[""]
[""]
[""]
[""]
[""]
[""]
[""]
[""]
[""]
[""]
[""]
[""]
[""]
[""]
[""]
[""]
[""]
[""]
[""]
[""]
[""]
[""]
[""]
[""]
[""]
[""]
[""]
[""]
[""]
[""]
[""]
[""]
[""]
[""]
[""]
[""]
[""]
[""]
[""]
[{"$f":"IF(B5701>0,A5700+1,\"\")","v":""}]
[""]
[""]
[""]
[""]
[""]
[""]
[""]
[""]
[""]
[""]
[""]
[""]
[""]
[""]
[""]
[""]
[""]
[""]
[""]
[""]
[""]
[""]
[""]
[""]
[""]
[""]
[""]
[""]
[""]
[""]
[""]
[""]
[""]
[""]
[""]
[""]
[""]
[""]
[""]
[""]
[""]
[""]
[""]
[""]
[""]
[""]
[""]
[""]
[""]
[""]
[""]
[""]
[""]
[""]
[""]
[""]
[""]
[""]
[""]
[""]
[""]
[""]
[""]
[{"$f":"IF(B5765>0,A5764+1,\"\")","v":""}]
[""]
[""]
[""]
[""]
[""]
[""]
[""]
[""]
[""]
[""]
[""]
[""]
[""]
[""]
[""]
[""]
[""]
[""]
[""]
[""]
[""]
[""]
[""]
[""]
[""]
[""]
[""]
[""]
[""]
[""]
[""]
[""]
[""]
[""]
[""]
[""]
[""]
[""]
[""]
[""]
[""]
[""]
[""]
[""]
[""]
[""]
[""]
[""]
[""]
[""]
[""]
[""]
[""]
[""]
[""]
[""]
[""]
[""]
[""]
[""]
[""]
[""]
[""]
[{"$f":"IF(B5829>0,A5828+1,\"\")","v":""}]
[""]
[""]
[""]
[""]
[""]
[""]
[""]
[""]
[""]
[""]
[""]
[""]
[""]
[""]
[""]
[""]
[""]
[""]
[""]
[""]
[""]
[""]
[""]
[""]
[""]
[""]
[""]
[""]
[""]
[""]
[""]
[""]
[""]
[""]
[""]
[""]
[""]
[""]
[""]
[""]
[""]
[""]
[""]
[""]
[""]
[""]
[""]
[""]
[""]
[""]
[""]
[""]
[""]
[""]
[""]
[""]
[""]
[""]
[""]
[""]
[""]
[""]
[""]
[{"$f":"IF(B5893>0,A5892+1,\"\")","v":""}]
[""]
[""]
[""]
[""]
[""]
[""]
[""]
[""]
[""]
[""]
[""]
[""]
[""]
[""]
[""]
[""]
[""]
[""]
[""]
[""]
[""]
[""]
[""]
[""]
[""]
[""]
[""]
[""]
[""]
[""]
[""]
[""]
[""]
[""]
[""]
[""]
[""]
[""]
[""]
[""]
[""]
[""]
[""]
[""]
[""]
[""]
[""]
[""]
[""]
[""]
[""]
[""]
[""]
[""]
[""]
[""]
[""]
[""]
[""]
[""]
[""]
[""]
[""]
[{"$f":"IF(B5957>0,A5956+1,\"\")","v":""}]
[""]
[""]
[""]
[""]
[""]
[""]
[""]
[""]
[""]
[""]
[""]
[""]
[""]
[""]
[""]
[""]
[""]
[""]
[""]
[""]
[""]
[""]
[""]
[""]
[""]
[""]
[""]
[""]
[""]
[""]
[""]
[""]
[""]
[""]
[""]
[""]
[""]
[""]
[""]
[""]
[""]
[""]
[""]
[""]
[""]
[""]
[""]
[""]
[""]
[""]
[""]
[""]
[""]
[""]
[""]
[""]
[""]
[""]
[""]
[""]
[""]
[""]
[""]
[{"$f":"IF(B6021>0,A6020+1,\"\")","v":""}]
[""]
[""]
[""]
[""]
[""]
[""]
[""]
[""]
[""]
[""]
[""]
[""]
[""]
[""]
[""]
[""]
[""]
[""]
[""]
[""]
[""]
[""]
[""]
[""]
[""]
[""]
[""]
[""]
[""]
[""]
[""]
[""]
[""]
[""]
[""]
[""]
[""]
[""]
[""]
[""]
[""]
[""]
[""]
[""]
[""]
[""]
[""]
[""]
[""]
[""]
[""]
[""]
[""]
[""]
[""]
[""]
[""]
[""]
[""]
[""]
[""]
[""]
[""]
[{"$f":"IF(B6085>0,A6084+1,\"\")","v":""}]
[""]
[""]
[""]
[""]
[""]
[""]
[""]
[""]
[""]
[""]
[""]
[""]
[""]
[""]
[""]
[""]
[""]
[""]
[""]
[""]
[""]
[""]
[""]
[""]
[""]
[""]
[""]
[""]
[""]
[""]
[""]
[""]
[""]
[""]
[""]
[""]
[""]
[""]
[""]
[""]
[""]
[""]
[""]
[""]
[""]
[""]
[""]
[""]
[""]
[""]
[""]
[""]
[""]
[""]
[""]
[""]
[""]
[""]
[""]
[""]
[""]
[""]
[""]
[{"$f":"IF(B6149>0,A6148+1,\"\")","v":""}]
[""]
[""]
[""]
[""]
[""]
[""]
[""]
[""]
[""]
[""]
[""]
[""]
[""]
[""]
[""]
[""]
[""]
[""]
[""]
[""]
[""]
[""]
[""]
[""]
[""]
[""]
[""]
[""]
[""]
[""]
[""]
[""]
[""]
[""]
[""]
[""]
[""]
[""]
[""]
[""]
[""]
[""]
[""]
[""]
[""]
[""]
[""]
[""]
[""]
[""]
[""]
[""]
[""]
[""]
[""]
[""]
[""]
[""]
[""]
[""]
[""]
[""]
[""]
[{"$f":"IF(B6213>0,A6212+1,\"\")","v":""}]
[""]
[""]
[""]
[""]
[""]
[""]
[""]
[""]
[""]
[""]
[""]
[""]
[""]
[""]
[""]
[""]
[""]
[""]
[""]
[""]
[""]
[""]
[""]
[""]
[""]
[""]
[""]
[""]
[""]
[""]
[""]
[""]
[""]
[""]
[""]
[""]
[""]
[""]
[""]
[""]
[""]
[""]
[""]
[""]
[""]
[""]
[""]
[""]
[""]
[""]
[""]
[""]
[""]
[""]
[""]
[""]
[""]
[""]
[""]
[""]
[""]
[""]
[""]
[{"$f":"IF(B6277>0,A6276+1,\"\")","v":""}]
[""]
[""]
[""]
[""]
[""]
[""]
[""]
[""]
[""]
[""]
[""]
[""]
[""]
[""]
[""]
[""]
[""]
[""]
[""]
[""]
[""]
[""]
[""]
[""]
[""]
[""]
[""]
[""]
[""]
[""]
[""]
[""]
[""]
[""]
[""]
[""]
[""]
[""]
[""]
[""]
[""]
[""]
[""]
[""]
[""]
[""]
[""]
[""]
[""]
[""]
[""]
[""]
[""]
[""]
[""]
[""]
[""]
[""]
[""]
[""]
[""]
[""]
[""]
[{"$f":"IF(B6341>0,A6340+1,\"\")","v":""}]
[""]
[""]
[""]
[""]
[""]
[""]
[""]
[""]
[""]
[""]
[""]
[""]
[""]
[""]
[""]
[""]
[""]
[""]
[""]
[""]
[""]
[""]
[""]
[""]
[""]
[""]
[""]
[""]
[""]
[""]
[""]
[""]
[""]
[""]
[""]
[""]
[""]
[""]
[""]
[""]
[""]
[""]
[""]
[""]
[""]
[""]
[""]
[""]
[""]
[""]
[""]
[""]
[""]
[""]
[""]
[""]
[""]
[""]
[""]
[""]
[""]
[""]
[""]
[{"$f":"IF(B6405>0,A6404+1,\"\")","v":""}]
[""]
[""]
[""]
[""]
[""]
[""]
[""]
[""]
[""]
[""]
[""]
[""]
[""]
[""]
[""]
[""]
[""]
[""]
[""]
[""]
[""]
[""]
[""]
[""]
[""]
[""]
[""]
[""]
[""]
[""]
[""]
[""]
[""]
[""]
[""]
[""]
[""]
[""]
[""]
[""]
[""]
[""]
[""]
[""]
[""]
[""]
[""]
[""]
[""]
[""]
[""]
[""]
[""]
[""]
[""]
[""]
[""]
[""]
[""]
[""]
[""]
[""]
[""]
[{"$f":"IF(B6469>0,A6468+1,\"\")","v":""}]
[""]
[""]
[""]
[""]
[""]
[""]
[""]
[""]
[""]
[""]
[""]
[""]
[""]
[""]
[""]
[""]
[""]
[""]
[""]
[""]
[""]
[""]
[""]
[""]
[""]
[""]
[""]
[""]
[""]
[""]
[""]
[""]
[""]
[""]
[""]
[""]
[""]
[""]
[""]
[""]
[""]
[""]
[""]
[""]
[""]
[""]
[""]
[""]
[""]
[""]
[""]
[""]
[""]
[""]
[""]
[""]
[""]
[""]
[""]
[""]
[""]
[""]
[""]
[{"$f":"IF(B6533>0,A6532+1,\"\")","v":""}]
[""]
[""]
[""]
[""]
[""]
[""]
[""]
[""]
[""]
[""]
[""]
[""]
[""]
[""]
[""]
[""]
[""]
[""]
[""]
[""]
[""]
[""]
[""]
[""]
[""]
[""]
[""]
[""]
[""]
[""]
[""]
[""]
[""]
[""]
[""]
[""]
[""]
[""]
[""]
[""]
[""]
[""]
[""]
[""]
[""]
[""]
[""]
[""]
[""]
[""]
[""]
[""]
[""]
[""]
[""]
[""]
[""]
[""]
[""]
[""]
[""]
[""]
[""]
[{"$f":"IF(B6597>0,A6596+1,\"\")","v":""}]
[""]
[""]
[""]
[""]
[""]
[""]
[""]
[""]
[""]
[""]
[""]
[""]
[""]
[""]
[""]
[""]
[""]
[""]
[""]
[""]
[""]
[""]
[""]
[""]
[""]
[""]
[""]
[""]
[""]
[""]
[""]
[""]
[""]
[""]
[""]
[""]
[""]
[""]
[""]
[""]
[""]
[""]
[""]
[""]
[""]
[""]
[""]
[""]
[""]
[""]
[""]
[""]
[""]
[""]
[""]
[""]
[""]
[""]
[""]
[""]
[""]
[""]
[""]
[{"$f":"IF(B6661>0,A6660+1,\"\")","v":""}]
[""]
[""]
[""]
[""]
[""]
[""]
[""]
[""]
[""]
[""]
[""]
[""]
[""]
[""]
[""]
[""]
[""]
[""]
[""]
[""]
[""]
[""]
[""]
[""]
[""]
[""]
[""]
[""]
[""]
[""]
[""]
[""]
[""]
[""]
[""]
[""]
[""]
[""]
[""]
[""]
[""]
[""]
[""]
[""]
[""]
[""]
[""]
[""]
[""]
[""]
[""]
[""]
[""]
[""]
[""]
[""]
[""]
[""]
[""]
[""]
[""]
[""]
[""]
[{"$f":"IF(B6725>0,A6724+1,\"\")","v":""}]
[""]
[""]
[""]
[""]
[""]
[""]
[""]
[""]
[""]
[""]
[""]
[""]
[""]
[""]
[""]
[""]
[""]
[""]
[""]
[""]
[""]
[""]
[""]
[""]
[""]
[""]
[""]
[""]
[""]
[""]
[""]
[""]
[""]
[""]
[""]
[""]
[""]
[""]
[""]
[""]
[""]
[""]
[""]
[""]
[""]
[""]
[""]
[""]
[""]
[""]
[""]
[""]
[""]
[""]
[""]
[""]
[""]
[""]
[""]
[""]
[""]
[""]
[""]
[{"$f":"IF(B6789>0,A6788+1,\"\")","v":""}]
[""]
[""]
[""]
[""]
[""]
[""]
[""]
[""]
[""]
[""]
[""]
[""]
[""]
[""]
[""]
[""]
[""]
[""]
[""]
[""]
[""]
[""]
[""]
[""]
[""]
[""]
[""]
[""]
[""]
[""]
[""]
[""]
[""]
[""]
[""]
[""]
[""]
[""]
[""]
[""]
[""]
[""]
[""]
[""]
[""]
[""]
[""]
[""]
[""]
[""]
[""]
[""]
[""]
[""]
[""]
[""]
[""]
[""]
[""]
[""]
[""]
[""]
[""]
[{"$f":"IF(B6853>0,A6852+1,\"\")","v":""}]
[""]
[""]
[""]
[""]
[""]
[""]
[""]
[""]
[""]
[""]
[""]
[""]
[""]
[""]
[""]
[""]
[""]
[""]
[""]
[""]
[""]
[""]
[""]
[""]
[""]
[""]
[""]
[""]
[""]
[""]
[""]
[""]
[""]
[""]
[""]
[""]
[""]
[""]
[""]
[""]
[""]
[""]
[""]
[""]
[""]
[""]
[""]
[""]
[""]
[""]
[""]
[""]
[""]
[""]
[""]
[""]
[""]
[""]
[""]
[""]
[""]
[""]
[""]
[{"$f":"IF(B6917>0,A6916+1,\"\")","v":""}]
[""]
[""]
[""]
[""]
[""]
[""]
[""]
[""]
[""]
[""]
[""]
[""]
[""]
[""]
[""]
[""]
[""]
[""]
[""]
[""]
[""]
[""]
[""]
[""]
[""]
[""]
[""]
[""]
[""]
[""]
[""]
[""]
[""]
[""]
[""]
[""]
[""]
[""]
[""]
[""]
[""]
[""]
[""]
[""]
[""]
[""]
[""]
[""]
[""]
[""]
[""]
[""]
[""]
[""]
[""]
[""]
[""]
[""]
[""]
[""]
[""]
[""]
[""]
[{"$f":"IF(B6981>0,A6980+1,\"\")","v":""}]
[""]
[""]
[""]
[""]
[""]
[""]
[""]
[""]
[""]
[""]
[""]
[""]
[""]
[""]
[""]
[""]
[""]
[""]
[""]
[""]
[""]
[""]
[""]
[""]
[""]
[""]
[""]
[""]
[""]
[""]
[""]
[""]
[""]
[""]
[""]
[""]
[""]
[""]
[""]
[""]
[""]
[""]
[""]
[""]
[""]
[""]
[""]
[""]
[""]
[""]
[""]
[""]
[""]
[""]
[""]
[""]
[""]
[""]
[""]
[""]
[""]
[""]
[""]
[{"$f":"IF(B7045>0,A7044+1,\"\")","v":""}]
[""]
[""]
[""]
[""]
[""]
[""]
[""]
[""]
[""]
[""]
[""]
[""]
[""]
[""]
[""]
[""]
[""]
[""]
[""]
[""]
[""]
[""]
[""]
[""]
[""]
[""]
[""]
[""]
[""]
[""]
[""]
[""]
[""]
[""]
[""]
[""]
[""]
[""]
[""]
[""]
[""]
[""]
[""]
[""]
[""]
[""]
[""]
[""]
[""]
[""]
[""]
[""]
[""]
[""]
[""]
[""]
[""]
[""]
[""]
[""]
[""]
[""]
[""]
[{"$f":"IF(B7109>0,A7108+1,\"\")","v":""}]
[""]
[""]
[""]
[""]
[""]
[""]
[""]
[""]
[""]
[""]
[""]
[""]
[""]
[""]
[""]
[""]
[""]
[""]
[""]
[""]
[""]
[""]
[""]
[""]
[""]
[""]
[""]
[""]
[""]
[""]
[""]
[""]
[""]
[""]
[""]
[""]
[""]
[""]
[""]
[""]
[""]
[""]
[""]
[""]
[""]
[""]
[""]
[""]
[""]
[""]
[""]
[""]
[""]
[""]
[""]
[""]
[""]
[""]
[""]
[""]
[""]
[""]
[""]
[{"$f":"IF(B7173>0,A7172+1,\"\")","v":""}]
[""]
[""]
[""]
[""]
[""]
[""]
[""]
[""]
[""]
[""]
[""]
[""]
[""]
[""]
[""]
[""]
[""]
[""]
[""]
[""]
[""]
[""]
[""]
[""]
[""]
[""]
[""]
[""]
[""]
[""]
[""]
[""]
[""]
[""]
[""]
[""]
[""]
[""]
[""]
[""]
[""]
[""]
[""]
[""]
[""]
[""]
[""]
[""]
[""]
[""]
[""]
[""]
[""]
[""]
[""]
[""]
[""]
[""]
[""]
[""]
[""]
[""]
[""]
[{"$f":"IF(B7237>0,A7236+1,\"\")","v":""}]
[""]
[""]
[""]
[""]
[""]
[""]
[""]
[""]
[""]
[""]
[""]
[""]
[""]
[""]
[""]
[""]
[""]
[""]
[""]
[""]
[""]
[""]
[""]
[""]
[""]
[""]
[""]
[""]
[""]
[""]
[""]
[""]
[""]
[""]
[""]
[""]
[""]
[""]
[""]
[""]
[""]
[""]
[""]
[""]
[""]
[""]
[""]
[""]
[""]
[""]
[""]
[""]
[""]
[""]
[""]
[""]
[""]
[""]
[""]
[""]
[""]
[""]
[""]
[{"$f":"IF(B7301>0,A7300+1,\"\")","v":""}]
[""]
[""]
[""]
[""]
[""]
[""]
[""]
[""]
[""]
[""]
[""]
[""]
[""]
[""]
[""]
[""]
[""]
[""]
[""]
[""]
[""]
[""]
[""]
[""]
[""]
[""]
[""]
[""]
[""]
[""]
[""]
[""]
[""]
[""]
[""]
[""]
[""]
[""]
[""]
[""]
[""]
[""]
[""]
[""]
[""]
[""]
[""]
[""]
[""]
[""]
[""]
[""]
[""]
[""]
[""]
[""]
[""]
[""]
[""]
[""]
[""]
[""]
[""]
[{"$f":"IF(B7365>0,A7364+1,\"\")","v":""}]
[""]
[""]
[""]
[""]
[""]
[""]
[""]
[""]
[""]
[""]
[""]
[""]
[""]
[""]
[""]
[""]
[""]
[""]
[""]
[""]
[""]
[""]
[""]
[""]
[""]
[""]
[""]
[""]
[""]
[""]
[""]
[""]
[""]
[""]
[""]
[""]
[""]
[""]
[""]
[""]
[""]
[""]
[""]
[""]
[""]
[""]
[""]
[""]
[""]
[""]
[""]
[""]
[""]
[""]
[""]
[""]
[""]
[""]
[""]
[""]
[""]
[""]
[""]
[{"$f":"IF(B7429>0,A7428+1,\"\")","v":""}]
[""]
[""]
[""]
[""]
[""]
[""]
[""]
[""]
[""]
[""]
[""]
[""]
[""]
[""]
[""]
[""]
[""]
[""]
[""]
[""]
[""]
[""]
[""]
[""]
[""]
[""]
[""]
[""]
[""]
[""]
[""]
[""]
[""]
[""]
[""]
[""]
[""]
[""]
[""]
[""]
[""]
[""]
[""]
[""]
[""]
[""]
[""]
[""]
[""]
[""]
[""]
[""]
[""]
[""]
[""]
[""]
[""]
[""]
[""]
[""]
[""]
[""]
[""]
[{"$f":"IF(B7493>0,A7492+1,\"\")","v":""}]
[""]
[""]
[""]
[""]
[""]
[""]
[""]
[""]
[""]
[""]
[""]
[""]
[""]
[""]
[""]
[""]
[""]
[""]
[""]
[""]
[""]
[""]
[""]
[""]
[""]
[""]
[""]
[""]
[""]
[""]
[""]
[""]
[""]
[""]
[""]
[""]
[""]
[""]
[""]
[""]
[""]
[""]
[""]
[""]
[""]
[""]
[""]
[""]
[""]
[""]
[""]
[""]
[""]
[""]
[""]
[""]
[""]
[""]
[""]
[""]
[""]
[""]
[""]
[{"$f":"IF(B7557>0,A7556+1,\"\")","v":""}]
[""]
[""]
[""]
[""]
[""]
[""]
[""]
[""]
[""]
[""]
[""]
[""]
[""]
[""]
[""]
[""]
[""]
[""]
[""]
[""]
[""]
[""]
[""]
[""]
[""]
[""]
[""]
[""]
[""]
[""]
[""]
[""]
[""]
[""]
[""]
[""]
[""]
[""]
[""]
[""]
[""]
[""]
[""]
[""]
[""]
[""]
[""]
[""]
[""]
[""]
[""]
[""]
[""]
[""]
[""]
[""]
[""]
[""]
[""]
[""]
[""]
[""]
[""]
[{"$f":"IF(B7621>0,A7620+1,\"\")","v":""}]
[""]
[""]
[""]
[""]
[""]
[""]
[""]
[""]
[""]
[""]
[""]
[""]
[""]
[""]
[""]
[""]
[""]
[""]
[""]
[""]
[""]
[""]
[""]
[""]
[""]
[""]
[""]
[""]
[""]
[""]
[""]
[""]
[""]
[""]
[""]
[""]
[""]
[""]
[""]
[""]
[""]
[""]
[""]
[""]
[""]
[""]
[""]
[""]
[""]
[""]
[""]
[""]
[""]
[""]
[""]
[""]
[""]
[""]
[""]
[""]
[""]
[""]
[""]
[{"$f":"IF(B7685>0,A7684+1,\"\")","v":""}]
[""]
[""]
[""]
[""]
[""]
[""]
[""]
[""]
[""]
[""]
[""]
[""]
[""]
[""]
[""]
[""]
[""]
[""]
[""]
[""]
[""]
[""]
[""]
[""]
[""]
[""]
[""]
[""]
[""]
[""]
[""]
[""]
[""]
[""]
[""]
[""]
[""]
[""]
[""]
[""]
[""]
[""]
[""]
[""]
[""]
[""]
[""]
[""]
[""]
[""]
[""]
[""]
[""]
[""]
[""]
[""]
[""]
[""]
[""]
[""]
[""]
[""]
[""]
[{"$f":"IF(B7749>0,A7748+1,\"\")","v":""}]
[""]
[""]
[""]
[""]
[""]
[""]
[""]
[""]
[""]
[""]
[""]
[""]
[""]
[""]
[""]
[""]
[""]
[""]
[""]
[""]
[""]
[""]
[""]
[""]
[""]
[""]
[""]
[""]
[""]
[""]
[""]
[""]
[""]
[""]
[""]
[""]
[""]
[""]
[""]
[""]
[""]
[""]
[""]
[""]
[""]
[""]
[""]
[""]
[""]
[""]
[""]
[""]
[""]
[""]
[""]
[""]
[""]
[""]
[""]
[""]
[""]
[""]
[""]
[{"$f":"IF(B7813>0,A7812+1,\"\")","v":""}]
[""]
[""]
[""]
[""]
[""]
[""]
[""]
[""]
[""]
[""]
[""]
[""]
[""]
[""]
[""]
[""]
[""]
[""]
[""]
[""]
[""]
[""]
[""]
[""]
[""]
[""]
[""]
[""]
[""]
[""]
[""]
[""]
[""]
[""]
[""]
[""]
[""]
[""]
[""]
[""]
[""]
[""]
[""]
[""]
[""]
[""]
[""]
[""]
[""]
[""]
[""]
[""]
[""]
[""]
[""]
[""]
[""]
[""]
[""]
[""]
[""]
[""]
[""]
[{"$f":"IF(B7877>0,A7876+1,\"\")","v":""}]
[""]
[""]
[""]
[""]
[""]
[""]
[""]
[""]
[""]
[""]
[""]
[""]
[""]
[""]
[""]
[""]
[""]
[""]
[""]
[""]
[""]
[""]
[""]
[""]
[""]
[""]
[""]
[""]
[""]
[""]
[""]
[""]
[""]
[""]
[""]
[""]
[""]
[""]
[""]
[""]
[""]
[""]
[""]
[""]
[""]
[""]
[""]
[""]
[""]
[""]
[""]
[""]
[""]
[""]
[""]
[""]
[""]
[""]
[""]
[""]
[""]
[""]
[""]
[{"$f":"IF(B7941>0,A7940+1,\"\")","v":""}]
[""]
[""]
[""]
[""]
[""]
[""]
[""]
[""]
[""]
[""]
[""]
[""]
[""]
[""]
[""]
[""]
[""]
[""]
[""]
[""]
[""]
[""]
[""]
[""]
[""]
[""]
[""]
[""]
[""]
[""]
[""]
[""]
[""]
[""]
[""]
[""]
[""]
[""]
[""]
[""]
[""]
[""]
[""]
[""]
[""]
[""]
[""]
[""]
[""]
[""]
[""]
[""]
[""]
[""]
[""]
[""]
[""]
[""]
[""]
[""]
[""]
[""]
[""]
[{"$f":"IF(B8005>0,A8004+1,\"\")","v":""}]
[""]
[""]
[""]
[""]
[""]
[""]
[""]
[""]
[""]
[""]
[""]
[""]
[""]
[""]
[""]
[""]
[""]
[""]
[""]
[""]
[""]
[""]
[""]
[""]
[""]
[""]
[""]
[""]
[""]
[""]
[""]
[""]
[""]
[""]
[""]
[""]
[""]
[""]
[""]
[""]
[""]
[""]
[""]
[""]
[""]
[""]
[""]
[""]
[""]
[""]
[""]
[""]
[""]
[""]
[""]
[""]
[""]
[""]
[""]
[""]
[""]
[""]
[""]
[{"$f":"IF(B8069>0,A8068+1,\"\")","v":""}]
[""]
[""]
[""]
[""]
[""]
[""]
[""]
[""]
[""]
[""]
[""]
[""]
[""]
[""]
[""]
[""]
[""]
[""]
[""]
[""]
[""]
[""]
[""]
[""]
[""]
[""]
[""]
[""]
[""]
[""]
[""]
[""]
[""]
[""]
[""]
[""]
[""]
[""]
[""]
[""]
[""]
[""]
[""]
[""]
[""]
[""]
[""]
[""]
[""]
[""]
[""]
[""]
[""]
[""]
[""]
[""]
[""]
[""]
[""]
[""]
[""]
[""]
[""]
[{"$f":"IF(B8133>0,A8132+1,\"\")","v":""}]
[""]
[""]
[""]
[""]
[""]
[""]
[""]
[""]
[""]
[""]
[""]
[""]
[""]
[""]
[""]
[""]
[""]
[""]
[""]
[""]
[""]
[""]
[""]
[""]
[""]
[""]
[""]
[""]
[""]
[""]
[""]
[""]
[""]
[""]
[""]
[""]
[""]
[""]
[""]
[""]
[""]
[""]
[""]
[""]
[""]
[""]
[""]
[""]
[""]
[""]
[""]
[""]
[""]
[""]
[""]
[""]
[""]
[""]
[""]
[""]
[""]
[""]
[""]
[{"$f":"IF(B8197>0,A8196+1,\"\")","v":""}]
[""]
[""]
[""]
[""]
[""]
[""]
[""]
[""]
[""]
[""]
[""]
[""]
[""]
[""]
[""]
[""]
[""]
[""]
[""]
[""]
[""]
[""]
[""]
[""]
[""]
[""]
[""]
[""]
[""]
[""]
[""]
[""]
[""]
[""]
[""]
[""]
[""]
[""]
[""]
[""]
[""]
[""]
[""]
[""]
[""]
[""]
[""]
[""]
[""]
[""]
[""]
[""]
[""]
[""]
[""]
[""]
[""]
[""]
[""]
[""]
[""]
[""]
[""]
[{"$f":"IF(B8261>0,A8260+1,\"\")","v":""}]
[""]
[""]
[""]
[""]
[""]
[""]
[""]
[""]
[""]
[""]
[""]
[""]
[""]
[""]
[""]
[""]
[""]
[""]
[""]
[""]
[""]
[""]
[""]
[""]
[""]
[""]
[""]
[""]
[""]
[""]
[""]
[""]
[""]
[""]
[""]
[""]
[""]
[""]
[""]
[""]
[""]
[""]
[""]
[""]
[""]
[""]
[""]
[""]
[""]
[""]
[""]
[""]
[""]
[""]
[""]
[""]
[""]
[""]
[""]
[""]
[""]
[""]
[""]
[{"$f":"IF(B8325>0,A8324+1,\"\")","v":""}]
[""]
[""]
[""]
[""]
[""]
[""]
[""]
[""]
[""]
[""]
[""]
[""]
[""]
[""]
[""]
[""]
[""]
[""]
[""]
[""]
[""]
[""]
[""]
[""]
[""]
[""]
[""]
[""]
[""]
[""]
[""]
[""]
[""]
[""]
[""]
[""]
[""]
[""]
[""]
[""]
[""]
[""]
[""]
[""]
[""]
[""]
[""]
[""]
[""]
[""]
[""]
[""]
[""]
[""]
[""]
[""]
[""]
[""]
[""]
[""]
[""]
[""]
[""]
[{"$f":"IF(B8389>0,A8388+1,\"\")","v":""}]
[""]
[""]
[""]
[""]
[""]
[""]
[""]
[""]
[""]
[""]
[""]
[""]
[""]
[""]
[""]
[""]
[""]
[""]
[""]
[""]
[""]
[""]
[""]
[""]
[""]
[""]
[""]
[""]
[""]
[""]
[""]
[""]
[""]
[""]
[""]
[""]
[""]
[""]
[""]
[""]
[""]
[""]
[""]
[""]
[""]
[""]
[""]
[""]
[""]
[""]
[""]
[""]
[""]
[""]
[""]
[""]
[""]
[""]
[""]
[""]
[""]
[""]
[""]
[{"$f":"IF(B8453>0,A8452+1,\"\")","v":""}]
[""]
[""]
[""]
[""]
[""]
[""]
[""]
[""]
[""]
[""]
[""]
[""]
[""]
[""]
[""]
[""]
[""]
[""]
[""]
[""]
[""]
[""]
[""]
[""]
[""]
[""]
[""]
[""]
[""]
[""]
[""]
[""]
[""]
[""]
[""]
[""]
[""]
[""]
[""]
[""]
[""]
[""]
[""]
[""]
[""]
[""]
[""]
[""]
[""]
[""]
[""]
[""]
[""]
[""]
[""]
[""]
[""]
[""]
[""]
[""]
[""]
[""]
[""]
[{"$f":"IF(B8517>0,A8516+1,\"\")","v":""}]
[""]
[""]
[""]
[""]
[""]
[""]
[""]
[""]
[""]
[""]
[""]
[""]
[""]
[""]
[""]
[""]
[""]
[""]
[""]
[""]
[""]
[""]
[""]
[""]
[""]
[""]
[""]
[""]
[""]
[""]
[""]
[""]
[""]
[""]
[""]
[""]
[""]
[""]
[""]
[""]
[""]
[""]
[""]
[""]
[""]
[""]
[""]
[""]
[""]
[""]
[""]
[""]
[""]
[""]
[""]
[""]
[""]
[""]
[""]
[""]
[""]
[""]
[""]
[{"$f":"IF(B8581>0,A8580+1,\"\")","v":""}]
[""]
[""]
[""]
[""]
[""]
[""]
[""]
[""]
[""]
[""]
[""]
[""]
[""]
[""]
[""]
[""]
[""]
[""]
[""]
[""]
[""]
[""]
[""]
[""]
[""]
[""]
[""]
[""]
[""]
[""]
[""]
[""]
[""]
[""]
[""]
[""]
[""]
[""]
[""]
[""]
[""]
[""]
[""]
[""]
[""]
[""]
[""]
[""]
[""]
[""]
[""]
[""]
[""]
[""]
[""]
[""]
[""]
[""]
[""]
[""]
[""]
[""]
[""]
[{"$f":"IF(B8645>0,A8644+1,\"\")","v":""}]
[""]
[""]
[""]
[""]
[""]
[""]
[""]
[""]
[""]
[""]
[""]
[""]
[""]
[""]
[""]
[""]
[""]
[""]
[""]
[""]
[""]
[""]
[""]
[""]
[""]
[""]
[""]
[""]
[""]
[""]
[""]
[""]
[""]
[""]
[""]
[""]
[""]
[""]
[""]
[""]
[""]
[""]
[""]
[""]
[""]
[""]
[""]
[""]
[""]
[""]
[""]
[""]
[""]
[""]
[""]
[""]
[""]
[""]
[""]
[""]
[""]
[""]
[""]
[{"$f":"IF(B8709>0,A8708+1,\"\")","v":""}]
[""]
[""]
[""]
[""]
[""]
[""]
[""]
[""]
[""]
[""]
[""]
[""]
[""]
[""]
[""]
[""]
[""]
[""]
[""]
[""]
[""]
[""]
[""]
[""]
[""]
[""]
[""]
[""]
[""]
[""]
[""]
[""]
[""]
[""]
[""]
[""]
[""]
[""]
[""]
[""]
[""]
[""]
[""]
[""]
[""]
[""]
[""]
[""]
[""]
[""]
[""]
[""]
[""]
[""]
[""]
[""]
[""]
[""]
[""]
[""]
[""]
[""]
[""]
[{"$f":"IF(B8773>0,A8772+1,\"\")","v":""}]
[""]
[""]
[""]
[""]
[""]
[""]
[""]
[""]
[""]
[""]
[""]
[""]
[""]
[""]
[""]
[""]
[""]
[""]
[""]
[""]
[""]
[""]
[""]
[""]
[""]
[""]
[""]
[""]
[""]
[""]
[""]
[""]
[""]
[""]
[""]
[""]
[""]
[""]
[""]
[""]
[""]
[""]
[""]
[""]
[""]
[""]
[""]
[""]
[""]
[""]
[""]
[""]
[""]
[""]
[""]
[""]
[""]
[""]
[""]
[""]
[""]
[""]
[""]
[{"$f":"IF(B8837>0,A8836+1,\"\")","v":""}]
[""]
[""]
[""]
[""]
[""]
[""]
[""]
[""]
[""]
[""]
[""]
[""]
[""]
[""]
[""]
[""]
[""]
[""]
[""]
[""]
[""]
[""]
[""]
[""]
[""]
[""]
[""]
[""]
[""]
[""]
[""]
[""]
[""]
[""]
[""]
[""]
[""]
[""]
[""]
[""]
[""]
[""]
[""]
[""]
[""]
[""]
[""]
[""]
[""]
[""]
[""]
[""]
[""]
[""]
[""]
[""]
[""]
[""]
[""]
[""]
[""]
[""]
[""]
[{"$f":"IF(B8901>0,A8900+1,\"\")","v":""}]
[""]
[""]
[""]
[""]
[""]
[""]
[""]
[""]
[""]
[""]
[""]
[""]
[""]
[""]
[""]
[""]
[""]
[""]
[""]
[""]
[""]
[""]
[""]
[""]
[""]
[""]
[""]
[""]
[""]
[""]
[""]
[""]
[""]
[""]
[""]
[""]
[""]
[""]
[""]
[""]
[""]
[""]
[""]
[""]
[""]
[""]
[""]
[""]
[""]
[""]
[""]
[""]
[""]
[""]
[""]
[""]
[""]
[""]
[""]
[""]
[""]
[""]
[""]
[{"$f":"IF(B8965>0,A8964+1,\"\")","v":""}]
[""]
[""]
[""]
[""]
[""]
[""]
[""]
[""]
[""]
[""]
[""]
[""]
[""]
[""]
[""]
[""]
[""]
[""]
[""]
[""]
[""]
[""]
[""]
[""]
[""]
[""]
[""]
[""]
[""]
[""]
[""]
[""]
[""]
[""]
[""]
[""]
[""]
[""]
[""]
[""]
[""]
[""]
[""]
[""]
[""]
[""]
[""]
[""]
[""]
[""]
[""]
[""]
[""]
[""]
[""]
[""]
[""]
[""]
[""]
[""]
[""]
[""]
[""]
[{"$f":"IF(B9029>0,A9028+1,\"\")","v":""}]
[""]
[""]
[""]
[""]
[""]
[""]
[""]
[""]
[""]
[""]
[""]
[""]
[""]
[""]
[""]
[""]
[""]
[""]
[""]
[""]
[""]
[""]
[""]
[""]
[""]
[""]
[""]
[""]
[""]
[""]
[""]
[""]
[""]
[""]
[""]
[""]
[""]
[""]
[""]
[""]
[""]
[""]
[""]
[""]
[""]
[""]
[""]
[""]
[""]
[""]
[""]
[""]
[""]
[""]
[""]
[""]
[""]
[""]
[""]
[""]
[""]
[""]
[""]
[{"$f":"IF(B9093>0,A9092+1,\"\")","v":""}]
[""]
[""]
[""]
[""]
[""]
[""]
[""]
[""]
[""]
[""]
[""]
[""]
[""]
[""]
[""]
[""]
[""]
[""]
[""]
[""]
[""]
[""]
[""]
[""]
[""]
[""]
[""]
[""]
[""]
[""]
[""]
[""]
[""]
[""]
[""]
[""]
[""]
[""]
[""]
[""]
[""]
[""]
[""]
[""]
[""]
[""]
[""]
[""]
[""]
[""]
[""]
[""]
[""]
[""]
[""]
[""]
[""]
[""]
[""]
[""]
[""]
[""]
[""]
[{"$f":"IF(B9157>0,A9156+1,\"\")","v":""}]
[""]
[""]
[""]
[""]
[""]
[""]
[""]
[""]
[""]
[""]
[""]
[""]
[""]
[""]
[""]
[""]
[""]
[""]
[""]
[""]
[""]
[""]
[""]
[""]
[""]
[""]
[""]
[""]
[""]
[""]
[""]
[""]
[""]
[""]
[""]
[""]
[""]
[""]
[""]
[""]
[""]
[""]
[""]
[""]
[""]
[""]
[""]
[""]
[""]
[""]
[""]
[""]
[""]
[""]
[""]
[""]
[""]
[""]
[""]
[""]
[""]
[""]
[""]
[{"$f":"IF(B9221>0,A9220+1,\"\")","v":""}]
[""]
[""]
[""]
[""]
[""]
[""]
[""]
[""]
[""]
[""]
[""]
[""]
[""]
[""]
[""]
[""]
[""]
[""]
[""]
[""]
[""]
[""]
[""]
[""]
[""]
[""]
[""]
[""]
[""]
[""]
[""]
[""]
[""]
[""]
[""]
[""]
[""]
[""]
[""]
[""]
[""]
[""]
[""]
[""]
[""]
[""]
[""]
[""]
[""]
[""]
[""]
[""]
[""]
[""]
[""]
[""]
[""]
[""]
[""]
[""]
[""]
[""]
[""]
[{"$f":"IF(B9285>0,A9284+1,\"\")","v":""}]
[""]
[""]
[""]
[""]
[""]
[""]
[""]
[""]
[""]
[""]
[""]
[""]
[""]
[""]
[""]
[""]
[""]
[""]
[""]
[""]
[""]
[""]
[""]
[""]
[""]
[""]
[""]
[""]
[""]
[""]
[""]
[""]
[""]
[""]
[""]
[""]
[""]
[""]
[""]
[""]
[""]
[""]
[""]
[""]
[""]
[""]
[""]
[""]
[""]
[""]
[""]
[""]
[""]
[""]
[""]
[""]
[""]
[""]
[""]
[""]
[""]
[""]
[""]
[{"$f":"IF(B9349>0,A9348+1,\"\")","v":""}]
[""]
[""]
[""]
[""]
[""]
[""]
[""]
[""]
[""]
[""]
[""]
[""]
[""]
[""]
[""]
[""]
[""]
[""]
[""]
[""]
[""]
[""]
[""]
[""]
[""]
[""]
[""]
[""]
[""]
[""]
[""]
[""]
[""]
[""]
[""]
[""]
[""]
[""]
[""]
[""]
[""]
[""]
[""]
[""]
[""]
[""]
[""]
[""]
[""]
[""]
[""]
[""]
[""]
[""]
[""]
[""]
[""]
[""]
[""]
[""]
[""]
[""]
[""]
[{"$f":"IF(B9413>0,A9412+1,\"\")","v":""}]
[""]
[""]
[""]
[""]
[""]
[""]
[""]
[""]
[""]
[""]
[""]
[""]
[""]
[""]
[""]
[""]
[""]
[""]
[""]
[""]
[""]
[""]
[""]
[""]
[""]
[""]
[""]
[""]
[""]
[""]
[""]
[""]
[""]
[""]
[""]
[""]
[""]
[""]
[""]
[""]
[""]
[""]
[""]
[""]
[""]
[""]
[""]
[""]
[""]
[""]
[""]
[""]
[""]
[""]
[""]
[""]
[""]
[""]
[""]
[""]
[""]
[""]
[""]
[{"$f":"IF(B9477>0,A9476+1,\"\")","v":""}]
[""]
[""]
[""]
[""]
[""]
[""]
[""]
[""]
[""]
[""]
[""]
[""]
[""]
[""]
[""]
[""]
[""]
[""]
[""]
[""]
[""]
[""]
[""]
[""]
[""]
[""]
[""]
[""]
[""]
[""]
[""]
[""]
[""]
[""]
[""]
[""]
[""]
[""]
[""]
[""]
[""]
[""]
[""]
[""]
[""]
[""]
[""]
[""]
[""]
[""]
[""]
[""]
[""]
[""]
[""]
[""]
[""]
[""]
[""]
[""]
[""]
[""]
[""]
[{"$f":"IF(B9541>0,A9540+1,\"\")","v":""}]
[""]
[""]
[""]
[""]
[""]
[""]
[""]
[""]
[""]
[""]
[""]
[""]
[""]
[""]
[""]
[""]
[""]
[""]
[""]
[""]
[""]
[""]
[""]
[""]
[""]
[""]
[""]
[""]
[""]
[""]
[""]
[""]
[""]
[""]
[""]
[""]
[""]
[""]
[""]
[""]
[""]
[""]
[""]
[""]
[""]
[""]
[""]
[""]
[""]
[""]
[""]
[""]
[""]
[""]
[""]
[""]
[""]
[""]
[""]
[""]
[""]
[""]
[""]
[{"$f":"IF(B9605>0,A9604+1,\"\")","v":""}]
[""]
[""]
[""]
[""]
[""]
[""]
[""]
[""]
[""]
[""]
[""]
[""]
[""]
[""]
[""]
[""]
[""]
[""]
[""]
[""]
[""]
[""]
[""]
[""]
[""]
[""]
[""]
[""]
[""]
[""]
[""]
[""]
[""]
[""]
[""]
[""]
[""]
[""]
[""]
[""]
[""]
[""]
[""]
[""]
[""]
[""]
[""]
[""]
[""]
[""]
[""]
[""]
[""]
[""]
[""]
[""]
[""]
[""]
[""]
[""]
[""]
[""]
[""]
[{"$f":"IF(B9669>0,A9668+1,\"\")","v":""}]
[""]
[""]
[""]
[""]
[""]
[""]
[""]
[""]
[""]
[""]
[""]
[""]
[""]
[""]
[""]
[""]
[""]
[""]
[""]
[""]
[""]
[""]
[""]
[""]
[""]
[""]
[""]
[""]
[""]
[""]
[""]
[""]
[""]
[""]
[""]
[""]
[""]
[""]
[""]
[""]
[""]
[""]
[""]
[""]
[""]
[""]
[""]
[""]
[""]
[""]
[""]
[""]
[""]
[""]
[""]
[""]
[""]
[""]
[""]
[""]
[""]
[""]
[""]
[{"$f":"IF(B9733>0,A9732+1,\"\")","v":""}]
[""]
[""]
[""]
[""]
[""]
[""]
[""]
[""]
[""]
[""]
[""]
[""]
[""]
[""]
[""]
[""]
[""]
[""]
[""]
[""]
[""]
[""]
[""]
[""]
[""]
[""]
[""]
[""]
[""]
[""]
[""]
[""]
[""]
[""]
[""]
[""]
[""]
[""]
[""]
[""]
[""]
[""]
[""]
[""]
[""]
[""]
[""]
[""]
[""]
[""]
[""]
[""]
[""]
[""]
[""]
[""]
[""]
[""]
[""]
[""]
[""]
[""]
[""]
[{"$f":"IF(B9797>0,A9796+1,\"\")","v":""}]
[""]
[""]
[""]
[""]
[""]
[""]
[""]
[""]
[""]
[""]
[""]
[""]
[""]
[""]
[""]
[""]
[""]
[""]
[""]
[""]
[""]
[""]
[""]
[""]
[""]
[""]
[""]
[""]
[""]
[""]
[""]
[""]
[""]
[""]
[""]
[""]
[""]
[""]
[""]
[""]
[""]
[""]
[""]
[""]
[""]
[""]
[""]
[""]
[""]
[""]
[""]
[""]
[""]
[""]
[""]
[""]
[""]
[""]
[""]
[""]
[""]
[""]
[""]
[{"$f":"IF(B9861>0,A9860+1,\"\")","v":""}]
[""]
[""]
[""]
[""]
[""]
[""]
[""]
[""]
[""]
[""]
[""]
[""]
[""]
[""]
[""]
[""]
[""]
[""]
[""]
[""]
[""]
[""]
[""]
[""]
[""]
[""]
[""]
[""]
[""]
[""]
[""]
[""]
[""]
[""]
[""]
[""]
[""]
[""]
[""]
[""]
[""]
[""]
[""]
[""]
[""]
[""]
[""]
[""]
[""]
[""]
[""]
[""]
[""]
[""]
[""]
[""]
[""]
[""]
[""]
[""]
[""]
[""]
[""]
[{"$f":"IF(B9925>0,A9924+1,\"\")","v":""}]
[""]
[""]
[""]
[""]
[""]
[""]
[""]
[""]
[""]
[""]
[""]
[""]
[""]
[""]
[""]
[""]
[""]
[""]
[""]
[""]
[""]
[""]
[""]
[""]
[""]
[""]
[""]
[""]
[""]
[""]
[""]
[""]
[""]
[""]
[""]
[""]
[""]
[""]
[""]
[""]
[""]
[""]
[""]
[""]
[""]
[""]
[""]
[""]
[""]
[""]
[""]
[""]
[""]
[""]
[""]
[""]
[""]
[""]
[""]
[""]
[""]
[""]
[""]
[{"$f":"IF(B9989>0,A9988+1,\"\")","v":""}]
[""]
[""]
[""]
[""]
[""]
[""]
[""]
[""]
[""]
[""]
[""]

{"sheet":"Daten","index":4,"n_rows":20,"n_cols":1,"rows_kept":20,"cut":false,"hidden":false,"merged":[]}
["Mengenangabe"]
[]
["Esslöffel"]
["Kg."]
["gr."]
["dl."]
["Kaffeelöffel"]
["Glas"]
["Centi Liter"]
["Liter"]
["Mili Liter"]
["prise"]
["Eier"]
["Eiweiss"]
["Eigelb"]
["Zucker"]
["Kokosflocken"]
["Stk."]
["Scheiben"]
["Teelöffel"]

{"sheet":"Vorlage","index":5,"n_rows":67,"n_cols":5,"rows_kept":67,"cut":false,"hidden":false,"merged":[[2,1,2,3],[17,1,17,3],[66,1,66,2],[66,3,66,4],[58,1,58,4],[45,1,45,4],[23,1,23,4],[46,1,56,4],[59,1,64,4]]}
[null,null,null,{"$f":"RIGHT(CELL(\"dateiname\",B1),LEN(CELL(\"dateiname\",B1))-FIND(\"]\",CELL(\"dateiname\",B1)))&\"  Rezept\"","v":"Vorlage  Rezept"}]
[]
[null,"MENUE"]
[]
[]
[]
[]
[]
[]
[]
[]
[]
[]
[]
[]
[]
[]
[null,"Name??"]
[]
[null,"Für\nPersonen",null,"?"]
[]
[]
[]
[null,{"$f":"\"Zutaten für \"&D20&\" \"&B18","v":"Zutaten für ? Name??"}]
[]
[null,"Menge:","Menge:","Was:","Beschreibung:"]
[]
[]
[]
[]
[]
[]
[]
[]
[]
[]
[]
[]
[]
[]
[]
[]
[]
[]
[]
[null,"Beschreiben:"]
[]
[]
[]
[]
[]
[]
[]
[]
[]
[]
[]
[]
[null,"TIPP:"]
[]
[]
[]
[]
[]
[]
[]
[null,{"$f":"TEXT(TODAY(),\"TT.MM.JJ\")&\"  © by mablu\"","v":"05.02.20  © by mablu"},null,{"$f":"CELL(\"Dateiname\",A1)","v":"C:\\Users\\MBDELL\\Documents\\Meine Rezepte\\[REZEPT-MB.xlsm]Vorlage"}]

{"sheet":"Butterzöpfe","index":6,"n_rows":67,"n_cols":5,"rows_kept":67,"cut":false,"hidden":false,"merged":[[59,1,64,4],[66,1,66,2],[66,3,66,4],[2,1,2,3],[17,1,17,3],[23,1,23,4],[45,1,45,4],[46,1,56,4],[58,1,58,4]]}
[null,null,null,{"$f":"RIGHT(CELL(\"dateiname\",B1),LEN(CELL(\"dateiname\",B1))-FIND(\"]\",CELL(\"dateiname\",B1)))&\"  Rezept\"","v":"Butterzöpfe  Rezept"}]
[]
[null,"MENUE"]
[]
[]
[]
[]
[]
[]
[]
[]
[]
[]
[]
[]
[]
[]
[null,"Butterzöpfe"]
[]
[null,"Für\nPersonen"]
[]
[]
[]
[null,{"$f":"\"Zutaten für \"&D20&\" \"&B18","v":"Zutaten für  Butterzöpfe"}]
[]
[null,"Menge:","Menge:","Was:","Beschreibung:"]
[null,"1","Kg.","Mehl","ins Becken geben"]
[null,"1","Esslöffel","Salz","ringsum streuen"]
[null,"5","dl.","Milch","wärmen (lauwarm)"]
[null,"150","gr.","Butter","flüssig machen nicht Heiss (in Mikrowelle wenn vorhanden)"]
[null,"1","prise","Salz","in wenig Milch auflösen zusammen mit der Hefe"]
[null,"40","gr.","Hefe","nicht Heiss werden lassen max. 30°"]
[]
[]
[]
[]
[]
[]
[]
[]
[]
[]
[]
[]
[]
[null,"Beschreiben:"]
[null,"Alle in Teigschüssel miteinander mischen. Den Teig gut kneten er darf aber nicht zu warm werden. Dann den teig zudecken und auf das doppelte Volumen aufgehen lassen, damit es schneller geht etwas warmes Wasser in das Abwaschbecken geben und die Teigschüssel zugedeckt darin warm werden lassen.\nTeig in 4 Stücke trennen und ausrollen in 4 lange Stangen die in der Mitte etwas dicker sind als am Ende, das gibt die schöne Zopfform. Dann werden die Zöpfe zu 2 Zöpfen geformt. Danach lässt man die geformten Zöpfe nochmals ca. 1 Stunde mit einem feuchten Tuch gedeckt aufgehen.\nMit Eigelb bestreichen für eine glänzende Aussenschale.\n\nBacken bei ca. 200° etwa 20 Minuten"]
[]
[]
[]
[]
[]
[]
[]
[]
[]
[]
[]
[null,"TIPP:"]
[null,"Backofenvorheitzen auf 200° ca. 10 Minuten\n\nFür einen Speckzopf, 2 Beutel a 120 gr. Speck anbraten gut abtrocknen und unter die Teigmasse geben vor dem 2. mal aufgehen lassen."]
[]
[]
[]
[]
[]
[]
[null,{"$f":"TEXT(TODAY(),\"TT.MM.JJ\")&\"  © by mablu\"","v":"05.02.20  © by mablu"},null,{"$f":"CELL(\"Dateiname\",A1)","v":"C:\\Users\\MBDELL\\Documents\\Meine Rezepte\\[REZEPT-MB.xlsm]Butterzöpfe"}]

{"sheet":"GP's Kokosmakronen","index":7,"n_rows":67,"n_cols":5,"rows_kept":67,"cut":false,"hidden":false,"merged":[[59,1,64,4],[66,1,66,2],[66,3,66,4],[2,1,2,3],[17,1,17,3],[23,1,23,4],[45,1,45,4],[46,1,56,4],[58,1,58,4]]}
[null,null,null,{"$f":"RIGHT(CELL(\"dateiname\",B1),LEN(CELL(\"dateiname\",B1))-FIND(\"]\",CELL(\"dateiname\",B1)))&\"  Rezept\"","v":"GP's Kokosmakronen  Rezept"}]
[]
[null,"MENUE"]
[]
[]
[]
[]
[]
[]
[]
[]
[]
[]
[]
[]
[]
[]
[null,"GP's Kokosmakronen Guetzli"]
[]
[null,"Für\nPersonen"]
[]
[]
[]
[null,{"$f":"\"Zutaten für \"&D20&\" \"&B18","v":"Zutaten für  GP's Kokosmakronen Guetzli"}]
[]
[null,"Menge:","Menge:","Was:","Beschreibung:"]
[null,"3","Eiweiss","schlagen","Steif schlagen zusammen mit den aufgeführten Zutaten"]
[null,"75","Zucker","einrühren","weiterschlagen und zugeben bis das Luftig glänzend wird"]
[null,"75","Zucker","einrühren","weiterschlagen und zugeben bis das Luftig glänzend wird"]
[null,"250","Kokosflocken","einrühren","zugeben unter ständigem rühren"]
[]
[]
[]
[]
[]
[]
[]
[]
[]
[]
[]
[]
[]
[]
[]
[null,"Beschreiben:"]
[null,"\nDas Formen ist mit einem Suppenlöffel einfacher!\nin der Mitte einfügen auf Backblech mit Backpapier\n\nBacken:\nCa. 5 Min. auf 250° in vorgeheitztem Backofen "]
[]
[]
[]
[]
[]
[]
[]
[]
[]
[]
[]
[null,"TIPP:"]
[null,"Lagerung:\n\nIn einem Tupperwaregefäss mit einem zitronenschnitz, dann bleiben sie länger Frisch und Saftig!"]
[]
[]
[]
[]
[]
[]
[null,{"$f":"TEXT(TODAY(),\"TT.MM.JJ\")&\"  © by mablu\"","v":"05.02.20  © by mablu"},null,{"$f":"CELL(\"Dateiname\",A1)","v":"C:\\Users\\MBDELL\\Documents\\Meine Rezepte\\[REZEPT-MB.xlsm]GP's Kokosmakronen"}]

{"sheet":"Wienerli im Teig","index":8,"n_rows":67,"n_cols":5,"rows_kept":67,"cut":false,"hidden":false,"merged":[[59,1,64,4],[66,1,66,2],[66,3,66,4],[2,1,2,3],[17,1,17,3],[23,1,23,4],[45,1,45,4],[46,1,56,4],[58,1,58,4]]}
[null,null,null,{"$f":"RIGHT(CELL(\"dateiname\",B1),LEN(CELL(\"dateiname\",B1))-FIND(\"]\",CELL(\"dateiname\",B1)))&\"  Rezept\"","v":"Wienerli im Teig  Rezept"}]
[]
[null,"MENUE"]
[]
[]
[]
[]
[]
[]
[]
[]
[]
[]
[]
[]
[]
[]
[null,"Wienerli im Teigmantel"]
[]
[null,"Für\nPersonen",null,4]
[]
[]
[]
[null,{"$f":"\"Zutaten für \"&D20&\" \"&B18","v":"Zutaten für 4 Wienerli im Teigmantel"}]
[]
[null,"Menge:","Menge:","Was:","Beschreibung:"]
[null,"8","Stk.","Wienerli","Auspacken trokenreiben"]
[null,"8","Scheiben","Käse","Scheiben Käre für hohe Temperaturen"]
[null,"1","Stk.","Ei","möglichst Frisch"]
[null,"1","Stk.","Blätterteig","ausgewahlt für grosses Backblech"]
[null,"1","Stk.","Backpapier","für unter die Wienerli weil der Käse ein wenig auslaufen kann"]
[]
[]
[]
[]
[]
[]
[]
[]
[]
[]
[]
[]
[]
[]
[null,"Beschreiben:"]
[null,"Blätterteig in ca. 3 cm breite Streifen schneiden mit Teigrad, es braucht am Schluss 8 Streifen!\nWienerli mit Käse ummanteln, und dann mit den Teigstreifen einwickeln.\nDarauf achten dass keine offenen Stellen sind wo der käse auslaufen könnte.\nBackpapier in Blech legen, darauf die Ummantelten Wienerli im Teig verteilen und mit Ei bestreichen.\n\nBackofen auf ca. 229° vorheizen\nDann auf mittlerer Höhe ca. 20 Minuten Backen"]
[]
[]
[]
[]
[]
[]
[]
[]
[]
[]
[]
[null,"TIPP:"]
[null,"Verzehr:\n\nMit Senf, Ketchup, Mayonnaise, Meerrettich oder anderes,\nwenn man es etwas deftiger mag, kann man auch mit Speck ummanteln anstelle Käse!"]
[]
[]
[]
[]
[]
[]
[null,{"$f":"TEXT(TODAY(),\"TT.MM.JJ\")&\"  © by mablu\"","v":"05.02.20  © by mablu"},null,{"$f":"CELL(\"Dateiname\",A1)","v":"C:\\Users\\MBDELL\\Documents\\Meine Rezepte\\[REZEPT-MB.xlsm]Wienerli im Teig"}]

{"sheet":"Pinos Focaccia","index":9,"n_rows":67,"n_cols":5,"rows_kept":67,"cut":false,"hidden":false,"merged":[[59,1,64,4],[66,1,66,2],[66,3,66,4],[2,1,2,3],[17,1,17,3],[23,1,23,4],[45,1,45,4],[46,1,56,4],[58,1,58,4]]}
[null,null,null,{"$f":"RIGHT(CELL(\"dateiname\",B1),LEN(CELL(\"dateiname\",B1))-FIND(\"]\",CELL(\"dateiname\",B1)))&\"  Rezept\"","v":"Pinos Focaccia  Rezept"}]
[]
[null,"MENUE"]
[]
[]
[]
[]
[]
[]
[]
[]
[]
[]
[]
[]
[]
[]
[null,"Focaccia von Pino"]
[]
[null,"Für\nPersonen",null,4]
[]
[]
[]
[null,{"$f":"\"Zutaten für \"&D20&\" \"&B18","v":"Zutaten für 4 Focaccia von Pino"}]
[]
[null,"Menge:","Menge:","Was:","Beschreibung:"]
[null,"500","gr.","Mehl"]
[null,"1.5","Teelöffel","Salz"]
[null,"20","gr.","Hele","eine halbe Portion"]
[null,"3.25","dl.","Wasser","lauwarm, mit Hefe auflösen"]
[null,"3","Esslöffel","Olivenöl","Jetzt alles mischen und Olivenöl beimengen und zu einem Teig verkneten"]
[null,"1","dl.","Olivenöl"]
[null,"5","Esslöffel","Rosmarinnadeln","zusammen mit dem dl Olivenäl erwärmen"]
[null,"0.5","Esslöffel","Salz","grobkörnig dazumischen"]
[]
[]
[]
[]
[]
[]
[]
[]
[]
[]
[]
[null,"Beschreiben:"]
[null,"Zubereitung:\n\nTeig ca. 1 Stunde aufgehen lassen. Bitte zudecken!\nTeig in 2 cm dick auswahlen und oben Kreuzweise einschneiden und mit Olivenöl bestreichen, ca mit der Hälfte Rosmarinöl.\nIm Vorgeheizten Ofen in der unteren Hälfte ca. 25 Min. backen.\nDanach mit dem Rest Rosmarinöl bestreichen fertig, en Guete"]
[]
[]
[]
[]
[]
[]
[]
[]
[]
[]
[]
[null,"TIPP:"]
[null,"Der Ursprung der Focaccia liegt inder RegionLigurien in Italien.\nAlternativ kann man auch noch mit Rosmarin bestreuen."]
[]
[]
[]
[]
[]
[]
[null,{"$f":"TEXT(TODAY(),\"TT.MM.JJ\")&\"  © by mablu\"","v":"05.02.20  © by mablu"},null,{"$f":"CELL(\"Dateiname\",A1)","v":"C:\\Users\\MBDELL\\Documents\\Meine Rezepte\\[REZEPT-MB.xlsm]Pinos Focaccia"}]

{"sheet":"Rhabarberwähe","index":10,"n_rows":67,"n_cols":5,"rows_kept":67,"cut":false,"hidden":false,"merged":[[59,1,64,4],[66,1,66,2],[66,3,66,4],[2,1,2,3],[17,1,17,3],[23,1,23,4],[45,1,45,4],[46,1,56,4],[58,1,58,4]]}
[null,null,null,{"$f":"RIGHT(CELL(\"dateiname\",B1),LEN(CELL(\"dateiname\",B1))-FIND(\"]\",CELL(\"dateiname\",B1)))&\"  Rezept\"","v":"Rhabarberwähe  Rezept"}]
[]
[null,"MENUE"]
[]
[]
[]
[]
[]
[]
[]
[]
[]
[]
[]
[]
[]
[]
[null,"Rhabarberwähe"]
[]
[null,"Für\nPersonen",null,4]
[]
[]
[]
[null,{"$f":"\"Zutaten für \"&D20&\" \"&B18","v":"Zutaten für 4 Rhabarberwähe"}]
[]
[null,"Menge:","Menge:","Was:","Beschreibung:"]
[null,"1","Stk.","Blätterteig","ausgewahlen 42 x 26 cm"]
[null,"3","Esslöffel","Haselnüsse","gemahlen"]
[null,"1","dl.","Sahne"]
[null,"1","dl.","Milch"]
[null,"100","gr.","Rahmquark"]
[null,"1/2","Teelöffel","Vanillepaste","(oder eine halbe Vanilleschote, davon das ausgekratzte Innere)"]
[null,"1","Esslöffel","Maisstärke ","(gehäuft)"]
[null,"4","Esslöffel","Zucker"]
[null,"5","Stk.","Rhabarber","stangen"]
[]
[]
[]
[]
[]
[]
[]
[]
[]
[]
[null,"Beschreiben:"]
[null,"Den Backofen auf 220 Grad vorheizen. Das Blech mit Backpapier auslegen und den Blätterteig darauf legen. Den Blätterteig mit einer Gabel locker verteilt einstechen. Die gemahlenen Haselnüsse auf dem Teig verteilen. Die Rhabarber rüsten und in Stücke schneiden. Die Rhabarberstücke auf dem Teig verteilen. Alle Zutaten für den Guss gut miteinander vermischen und vorsichtig über die Rhabarbern geben. Das Blech in die unterste Rille des Backofens schieben und für 30 bis 45 Minuten Backen. Dabei die Wähe im Auge behalten, damit sie nicht anbrennt. Nach der Backzeit die Wähe aus dem Ofen nehmen, etwas abkühlen lassen und aus dem Blech nehmen. Die Wähe lauwarm oder kalt servieren. "]
[]
[]
[]
[]
[]
[]
[]
[]
[]
[]
[]
[null,"TIPP:"]
[null,"Nach Belieben die Rhabarberwähe mit Puderzucker bestreuen."]
[]
[]
[]
[]
[]
[]
[null,{"$f":"TEXT(TODAY(),\"TT.MM.JJ\")&\"  © by mablu\"","v":"05.02.20  © by mablu"},null,{"$f":"CELL(\"Dateiname\",A1)","v":"C:\\Users\\MBDELL\\Documents\\Meine Rezepte\\[REZEPT-MB.xlsm]Rhabarberwähe"}]