{"text_format":"1","workbook":"xlsx","n_sheets":4,"sheets":["Kalender","Feiertage","Mondphasen","Tabelle"],"not_rendered":{"charts":0,"images":2,"macros":1,"external_links":0,"defined_names":7,"comments":0,"pivot_tables":0},"unopened":[],"bounds":{"document_bytes":16777216,"sheet_cells":100000,"rows_first":2000,"rows_last":500,"rows_between":2000,"halvings":0,"cell_chars":16384,"cell_head_chars":4096},"cells_cut":0,"cells_raw":0,"read":"whole","date_system":"1900"}

{"sheet":"Kalender","index":0,"n_rows":34,"n_cols":72,"rows_kept":34,"cut":false,"hidden":false,"merged":[[0,0,0,9],[0,11,0,18],[2,36,2,41],[2,42,2,47],[2,48,2,53],[0,21,0,30],[2,54,2,59],[2,60,2,65],[2,66,2,71],[2,0,2,5],[2,6,2,11],[2,12,2,17],[2,18,2,23],[2,24,2,29],[2,30,2,35]]}
["Kalender",null,null,null,null,null,null,null,null,null,null,2026]
[null,null,{"$f":"NETWORKDAYS(A4,EOMONTH(A4,0),GFT)","v":20},"Arbeitstage",null,null,null,null,{"$f":"NETWORKDAYS(G4,EOMONTH(G4,0),GFT)","v":20},"Arbeitstage",null,null,null,null,{"$f":"NETWORKDAYS(M4,EOMONTH(M4,0),GFT)","v":22},"Arbeitstage",null,null,null,null,{"$f":"NETWORKDAYS(S4,EOMONTH(S4,0),GFT)","v":20},"Arbeitstage",null,null,null,null,{"$f":"NETWORKDAYS(Y4,EOMONTH(Y4,0),GFT)","v":19},"Arbeitstage",null,null,null,null,{"$f":"NETWORKDAYS(AE4,EOMONTH(AE4,0),GFT)","v":22},"Arbeitstage",null,null,null,null,{"$f":"NETWORKDAYS(AK4,EOMONTH(AK4,0),GFT)","v":23},"Arbeitstage",null,null,null,null,{"$f":"NETWORKDAYS(AQ4,EOMONTH(AQ4,0),GFT)","v":21},"Arbeitstage",null,null,null,null,{"$f":"NETWORKDAYS(AW4,EOMONTH(AW4,0),GFT)","v":22},"Arbeitstage",null,null,null,null,{"$f":"NETWORKDAYS(BC4,EOMONTH(BC4,0),GFT)","v":22},"Arbeitstage",null,null,null,null,{"$f":"NETWORKDAYS(BI4,EOMONTH(BI4,0),GFT)","v":21},"Arbeitstage",null,null,null,null,{"$f":"NETWORKDAYS(BO4,EOMONTH(BO4,0),GFT)","v":22},"Arbeitstage"]
["Januar",null,null,null,null,null,"Februar",null,null,null,null,null,"März",null,null,null,null,null,"April",null,null,null,null,null,"Mai",null,null,null,null,null,"Juni",null,null,null,null,null,"Juli",null,null,null,null,null,"August",null,null,null,null,null,"September",null,null,null,null,null,"Oktober",null,null,null,null,null,"November",null,null,null,null,null,"Dezember"]
[{"$f":"IFERROR((ROW()-3&\".\"&A$3&\".\"&$L$1)*1,\"\")","v":"2026-01-01"},{"$f":"IFERROR((ROW()-3&\".\"&A$3&\".\"&$L$1)*1,\"\")","v":46023},{"$f":"A4","v":"2026-01-01"},{"$f":"IFERROR(VLOOKUP(B4,Feiertage!$A$3:$B$29,2,FALSE),\"\")","v":"Neujahr"},{"$f":"IFERROR(VLOOKUP(B4,Mondphasen!$G$23:$H$36,2,FALSE),\"\")","v":""},{"$f":"IFERROR(WEEKNUM(A4,21),\"\")","v":1},{"$f":"IFERROR((ROW()-3&\".\"&G$3&\".\"&$L$1)*1,\"\")","v":"2026-02-01"},{"$f":"IFERROR((ROW()-3&\".\"&G$3&\".\"&$L$1)*1,\"\")","v":46054},{"$f":"G4","v":"2026-02-01"},{"$f":"IFERROR(VLOOKUP(H4,Feiertage!$A$3:$B$29,2,FALSE),\"\")","v":""},{"$f":"IFERROR(VLOOKUP(H4,Mondphasen!$G$23:$H$36,2,FALSE),\"\")","v":""},{"$f":"IFERROR(WEEKNUM(G4,21),\"\")","v":5},{"$f":"IFERROR((ROW()-3&\".\"&M$3&\".\"&$L$1)*1,\"\")","v":"2026-03-01"},{"$f":"IFERROR((ROW()-3&\".\"&M$3&\".\"&$L$1)*1,\"\")","v":46082},{"$f":"M4","v":"2026-03-01"},{"$f":"IFERROR(VLOOKUP(N4,Feiertage!$A$3:$B$29,2,FALSE),\"\")","v":""},{"$f":"IFERROR(VLOOKUP(N4,Mondphasen!$G$23:$H$36,2,FALSE),\"\")","v":""},{"$f":"IFERROR(WEEKNUM(M4,21),\"\")","v":9},{"$f":"IFERROR((ROW()-3&\".\"&S$3&\".\"&$L$1)*1,\"\")","v":"2026-04-01"},{"$f":"IFERROR((ROW()-3&\".\"&S$3&\".\"&$L$1)*1,\"\")","v":46113},{"$f":"S4","v":"2026-04-01"},{"$f":"IFERROR(VLOOKUP(T4,Feiertage!$A$3:$B$29,2,FALSE),\"\")","v":""},{"$f":"IFERROR(VLOOKUP(T4,Mondphasen!$G$23:$H$36,2,FALSE),\"\")","v":""},{"$f":"IFERROR(WEEKNUM(S4,21),\"\")","v":14},{"$f":"IFERROR((ROW()-3&\".\"&Y$3&\".\"&$L$1)*1,\"\")","v":"2026-05-01"},{"$f":"IFERROR((ROW()-3&\".\"&Y$3&\".\"&$L$1)*1,\"\")","v":46143},{"$f":"Y4","v":"2026-05-01"},{"$f":"IFERROR(VLOOKUP(Z4,Feiertage!$A$3:$B$29,2,FALSE),\"\")","v":"Tag der Arbeit"},{"$f":"IFERROR(VLOOKUP(Z4,Mondphasen!$G$23:$H$36,2,FALSE),\"\")","v":"l"},{"$f":"IFERROR(WEEKNUM(Y4,21),\"\")","v":18},{"$f":"IFERROR((ROW()-3&\".\"&AE$3&\".\"&$L$1)*1,\"\")","v":"2026-06-01"},{"$f":"IFERROR((ROW()-3&\".\"&AE$3&\".\"&$L$1)*1,\"\")","v":46174},{"$f":"AE4","v":"2026-06-01"},{"$f":"IFERROR(VLOOKUP(AF4,Feiertage!$A$3:$B$29,2,FALSE),\"\")","v":""},{"$f":"IFERROR(VLOOKUP(AF4,Mondphasen!$G$23:$H$36,2,FALSE),\"\")","v":""},{"$f":"IFERROR(WEEKNUM(AE4,21),\"\")","v":23},{"$f":"IFERROR((ROW()-3&\".\"&AK$3&\".\"&$L$1)*1,\"\")","v":"2026-07-01"},{"$f":"IFERROR((ROW()-3&\".\"&AK$3&\".\"&$L$1)*1,\"\")","v":46204},{"$f":"AK4","v":"2026-07-01"},{"$f":"IFERROR(VLOOKUP(AL4,Feiertage!$A$3:$B$29,2,FALSE),\"\")","v":""},{"$f":"IFERROR(VLOOKUP(AL4,Mondphasen!$G$23:$H$36,2,FALSE),\"\")","v":""},{"$f":"IFERROR(WEEKNUM(AK4,21),\"\")","v":27},{"$f":"IFERROR((ROW()-3&\".\"&AQ$3&\".\"&$L$1)*1,\"\")","v":"2026-08-01"},{"$f":"IFERROR((ROW()-3&\".\"&AQ$3&\".\"&$L$1)*1,\"\")","v":46235},{"$f":"AQ4","v":"2026-08-01"},{"$f":"IFERROR(VLOOKUP(AR4,Feiertage!$A$3:$B$29,2,FALSE),\"\")","v":"National-Feiertag CH"},{"$f":"IFERROR(VLOOKUP(AR4,Mondphasen!$G$23:$H$36,2,FALSE),\"\")","v":""},{"$f":"IFERROR(WEEKNUM(AQ4,21),\"\")","v":31},{"$f":"IFERROR((ROW()-3&\".\"&AW$3&\".\"&$L$1)*1,\"\")","v":"2026-09-01"},{"$f":"IFERROR((ROW()-3&\".\"&AW$3&\".\"&$L$1)*1,\"\")","v":46266},{"$f":"AW4","v":"2026-09-01"},{"$f":"IFERROR(VLOOKUP(AX4,Feiertage!$A$3:$B$29,2,FALSE),\"\")","v":""},{"$f":"IFERROR(VLOOKUP(AX4,Mondphasen!$G$23:$H$36,2,FALSE),\"\")","v":""},{"$f":"IFERROR(WEEKNUM(AW4,21),\"\")","v":36},{"$f":"IFERROR((ROW()-3&\".\"&BC$3&\".\"&$L$1)*1,\"\")","v":"2026-10-01"},{"$f":"IFERROR((ROW()-3&\".\"&BC$3&\".\"&$L$1)*1,\"\")","v":46296},{"$f":"BC4","v":"2026-10-01"},{"$f":"IFERROR(VLOOKUP(BD4,Feiertage!$A$3:$B$29,2,FALSE),\"\")","v":""},{"$f":"IFERROR(VLOOKUP(BD4,Mondphasen!$G$23:$H$36,2,FALSE),\"\")","v":""},{"$f":"IFERROR(WEEKNUM(BC4,21),\"\")","v":40},{"$f":"IFERROR((ROW()-3&\".\"&BI$3&\".\"&$L$1)*1,\"\")","v":"2026-11-01"},{"$f":"IFERROR((ROW()-3&\".\"&BI$3&\".\"&$L$1)*1,\"\")","v":46327},{"$f":"BI4","v":"2026-11-01"},{"$f":"IFERROR(VLOOKUP(BJ4,Feiertage!$A$3:$B$29,2,FALSE),\"\")","v":"Allerheiligen"},{"$f":"IFERROR(VLOOKUP(BJ4,Mondphasen!$G$23:$H$36,2,FALSE),\"\")","v":""},{"$f":"IFERROR(WEEKNUM(BI4,21),\"\")","v":44},{"$f":"IFERROR((ROW()-3&\".\"&BO$3&\".\"&$L$1)*1,\"\")","v":"2026-12-01"},{"$f":"IFERROR((ROW()-3&\".\"&BO$3&\".\"&$L$1)*1,\"\")","v":46357},{"$f":"BO4","v":"2026-12-01"},{"$f":"IFERROR(VLOOKUP(BP4,Feiertage!$A$3:$B$29,2,FALSE),\"\")","v":""},{"$f":"IFERROR(VLOOKUP(BP4,Mondphasen!$G$23:$H$36,2,FALSE),\"\")","v":""},{"$f":"IFERROR(WEEKNUM(BO4,21),\"\")","v":49}]
["2026-01-02",46024,{"$f":"A5","v":"2026-01-02"},{"$f":"IFERROR(VLOOKUP(B5,Feiertage!$A$3:$B$29,2,FALSE),\"\")","v":"Berchtoldstag"},{"$f":"IFERROR(VLOOKUP(B5,Mondphasen!$G$23:$H$36,2,FALSE),\"\")","v":""},{"$f":"IFERROR(WEEKNUM(A5,21),\"\")","v":1},"2026-02-02",46055,{"$f":"G5","v":"2026-02-02"},{"$f":"IFERROR(VLOOKUP(H5,Feiertage!$A$3:$B$29,2,FALSE),\"\")","v":""},{"$f":"IFERROR(VLOOKUP(H5,Mondphasen!$G$23:$H$36,2,FALSE),\"\")","v":"l"},6,"2026-03-02",46083,{"$f":"M5","v":"2026-03-02"},{"$f":"IFERROR(VLOOKUP(N5,Feiertage!$A$3:$B$29,2,FALSE),\"\")","v":""},{"$f":"IFERROR(VLOOKUP(N5,Mondphasen!$G$23:$H$36,2,FALSE),\"\")","v":""},{"$f":"IFERROR(WEEKNUM(M5,21),\"\")","v":10},"2026-04-02",46114,{"$f":"S5","v":"2026-04-02"},{"$f":"IFERROR(VLOOKUP(T5,Feiertage!$A$3:$B$29,2,FALSE),\"\")","v":"Grün-Donnerstag"},{"$f":"IFERROR(VLOOKUP(T5,Mondphasen!$G$23:$H$36,2,FALSE),\"\")","v":"l"},14,"2026-05-02",46144,{"$f":"Y5","v":"2026-05-02"},{"$f":"IFERROR(VLOOKUP(Z5,Feiertage!$A$3:$B$29,2,FALSE),\"\")","v":""},{"$f":"IFERROR(VLOOKUP(Z5,Mondphasen!$G$23:$H$36,2,FALSE),\"\")","v":""},18,"2026-06-02",46175,{"$f":"AE5","v":"2026-06-02"},{"$f":"IFERROR(VLOOKUP(AF5,Feiertage!$A$3:$B$29,2,FALSE),\"\")","v":""},{"$f":"IFERROR(VLOOKUP(AF5,Mondphasen!$G$23:$H$36,2,FALSE),\"\")","v":""},23,"2026-07-02",46205,{"$f":"AK5","v":"2026-07-02"},{"$f":"IFERROR(VLOOKUP(AL5,Feiertage!$A$3:$B$29,2,FALSE),\"\")","v":""},{"$f":"IFERROR(VLOOKUP(AL5,Mondphasen!$G$23:$H$36,2,FALSE),\"\")","v":""},27,"2026-08-02",46236,{"$f":"AQ5","v":"2026-08-02"},{"$f":"IFERROR(VLOOKUP(AR5,Feiertage!$A$3:$B$29,2,FALSE),\"\")","v":""},{"$f":"IFERROR(VLOOKUP(AR5,Mondphasen!$G$23:$H$36,2,FALSE),\"\")","v":""},31,"2026-09-02",46267,{"$f":"AW5","v":"2026-09-02"},{"$f":"IFERROR(VLOOKUP(AX5,Feiertage!$A$3:$B$29,2,FALSE),\"\")","v":""},{"$f":"IFERROR(VLOOKUP(AX5,Mondphasen!$G$23:$H$36,2,FALSE),\"\")","v":""},36,"2026-10-02",46297,{"$f":"BC5","v":"2026-10-02"},{"$f":"IFERROR(VLOOKUP(BD5,Feiertage!$A$3:$B$29,2,FALSE),\"\")","v":""},{"$f":"IFERROR(VLOOKUP(BD5,Mondphasen!$G$23:$H$36,2,FALSE),\"\")","v":""},40,"2026-11-02",46328,{"$f":"BI5","v":"2026-11-02"},{"$f":"IFERROR(VLOOKUP(BJ5,Feiertage!$A$3:$B$29,2,FALSE),\"\")","v":""},{"$f":"IFERROR(VLOOKUP(BJ5,Mondphasen!$G$23:$H$36,2,FALSE),\"\")","v":""},45,"2026-12-02",46358,{"$f":"BO5","v":"2026-12-02"},{"$f":"IFERROR(VLOOKUP(BP5,Feiertage!$A$3:$B$29,2,FALSE),\"\")","v":""},{"$f":"IFERROR(VLOOKUP(BP5,Mondphasen!$G$23:$H$36,2,FALSE),\"\")","v":""},{"$f":"IFERROR(WEEKNUM(BO5,21),\"\")","v":49}]
["2026-01-03",46025,"2026-01-03",{"$f":"IFERROR(VLOOKUP(B6,Feiertage!$A$3:$B$29,2,FALSE),\"\")","v":""},{"$f":"IFERROR(VLOOKUP(B6,Mondphasen!$G$23:$H$36,2,FALSE),\"\")","v":"l"},1,"2026-02-03",46056,"2026-02-03",{"$f":"IFERROR(VLOOKUP(H6,Feiertage!$A$3:$B$29,2,FALSE),\"\")","v":""},{"$f":"IFERROR(VLOOKUP(H6,Mondphasen!$G$23:$H$36,2,FALSE),\"\")","v":""},6,"2026-03-03",46084,"2026-03-03",{"$f":"IFERROR(VLOOKUP(N6,Feiertage!$A$3:$B$29,2,FALSE),\"\")","v":""},{"$f":"IFERROR(VLOOKUP(N6,Mondphasen!$G$23:$H$36,2,FALSE),\"\")","v":"l"},10,"2026-04-03",46115,"2026-04-03",{"$f":"IFERROR(VLOOKUP(T6,Feiertage!$A$3:$B$29,2,FALSE),\"\")","v":"Karfreitag"},{"$f":"IFERROR(VLOOKUP(T6,Mondphasen!$G$23:$H$36,2,FALSE),\"\")","v":""},14,"2026-05-03",46145,"2026-05-03",{"$f":"IFERROR(VLOOKUP(Z6,Feiertage!$A$3:$B$29,2,FALSE),\"\")","v":""},{"$f":"IFERROR(VLOOKUP(Z6,Mondphasen!$G$23:$H$36,2,FALSE),\"\")","v":""},18,"2026-06-03",46176,"2026-06-03",{"$f":"IFERROR(VLOOKUP(AF6,Feiertage!$A$3:$B$29,2,FALSE),\"\")","v":""},{"$f":"IFERROR(VLOOKUP(AF6,Mondphasen!$G$23:$H$36,2,FALSE),\"\")","v":""},23,"2026-07-03",46206,"2026-07-03",{"$f":"IFERROR(VLOOKUP(AL6,Feiertage!$A$3:$B$29,2,FALSE),\"\")","v":""},{"$f":"IFERROR(VLOOKUP(AL6,Mondphasen!$G$23:$H$36,2,FALSE),\"\")","v":""},27,"2026-08-03",46237,"2026-08-03",{"$f":"IFERROR(VLOOKUP(AR6,Feiertage!$A$3:$B$29,2,FALSE),\"\")","v":""},{"$f":"IFERROR(VLOOKUP(AR6,Mondphasen!$G$23:$H$36,2,FALSE),\"\")","v":""},32,"2026-09-03",46268,"2026-09-03",{"$f":"IFERROR(VLOOKUP(AX6,Feiertage!$A$3:$B$29,2,FALSE),\"\")","v":""},{"$f":"IFERROR(VLOOKUP(AX6,Mondphasen!$G$23:$H$36,2,FALSE),\"\")","v":""},36,"2026-10-03",46298,"2026-10-03",{"$f":"IFERROR(VLOOKUP(BD6,Feiertage!$A$3:$B$29,2,FALSE),\"\")","v":""},{"$f":"IFERROR(VLOOKUP(BD6,Mondphasen!$G$23:$H$36,2,FALSE),\"\")","v":""},40,"2026-11-03",46329,"2026-11-03",{"$f":"IFERROR(VLOOKUP(BJ6,Feiertage!$A$3:$B$29,2,FALSE),\"\")","v":""},{"$f":"IFERROR(VLOOKUP(BJ6,Mondphasen!$G$23:$H$36,2,FALSE),\"\")","v":""},45,"2026-12-03",46359,"2026-12-03",{"$f":"IFERROR(VLOOKUP(BP6,Feiertage!$A$3:$B$29,2,FALSE),\"\")","v":""},{"$f":"IFERROR(VLOOKUP(BP6,Mondphasen!$G$23:$H$36,2,FALSE),\"\")","v":""},49]
["2026-01-04",46026,"2026-01-04",{"$f":"IFERROR(VLOOKUP(B7,Feiertage!$A$3:$B$29,2,FALSE),\"\")","v":""},{"$f":"IFERROR(VLOOKUP(B7,Mondphasen!$G$23:$H$36,2,FALSE),\"\")","v":""},1,"2026-02-04",46057,"2026-02-04",{"$f":"IFERROR(VLOOKUP(H7,Feiertage!$A$3:$B$29,2,FALSE),\"\")","v":""},{"$f":"IFERROR(VLOOKUP(H7,Mondphasen!$G$23:$H$36,2,FALSE),\"\")","v":""},6,"2026-03-04",46085,"2026-03-04",{"$f":"IFERROR(VLOOKUP(N7,Feiertage!$A$3:$B$29,2,FALSE),\"\")","v":""},{"$f":"IFERROR(VLOOKUP(N7,Mondphasen!$G$23:$H$36,2,FALSE),\"\")","v":""},10,"2026-04-04",46116,"2026-04-04",{"$f":"IFERROR(VLOOKUP(T7,Feiertage!$A$3:$B$29,2,FALSE),\"\")","v":""},{"$f":"IFERROR(VLOOKUP(T7,Mondphasen!$G$23:$H$36,2,FALSE),\"\")","v":""},14,"2026-05-04",46146,"2026-05-04",{"$f":"IFERROR(VLOOKUP(Z7,Feiertage!$A$3:$B$29,2,FALSE),\"\")","v":""},{"$f":"IFERROR(VLOOKUP(Z7,Mondphasen!$G$23:$H$36,2,FALSE),\"\")","v":""},19,"2026-06-04",46177,"2026-06-04",{"$f":"IFERROR(VLOOKUP(AF7,Feiertage!$A$3:$B$29,2,FALSE),\"\")","v":"Fronleichnam"},{"$f":"IFERROR(VLOOKUP(AF7,Mondphasen!$G$23:$H$36,2,FALSE),\"\")","v":""},23,"2026-07-04",46207,"2026-07-04",{"$f":"IFERROR(VLOOKUP(AL7,Feiertage!$A$3:$B$29,2,FALSE),\"\")","v":""},{"$f":"IFERROR(VLOOKUP(AL7,Mondphasen!$G$23:$H$36,2,FALSE),\"\")","v":""},27,"2026-08-04",46238,"2026-08-04",{"$f":"IFERROR(VLOOKUP(AR7,Feiertage!$A$3:$B$29,2,FALSE),\"\")","v":""},{"$f":"IFERROR(VLOOKUP(AR7,Mondphasen!$G$23:$H$36,2,FALSE),\"\")","v":""},32,"2026-09-04",46269,"2026-09-04",{"$f":"IFERROR(VLOOKUP(AX7,Feiertage!$A$3:$B$29,2,FALSE),\"\")","v":""},{"$f":"IFERROR(VLOOKUP(AX7,Mondphasen!$G$23:$H$36,2,FALSE),\"\")","v":""},36,"2026-10-04",46299,"2026-10-04",{"$f":"IFERROR(VLOOKUP(BD7,Feiertage!$A$3:$B$29,2,FALSE),\"\")","v":""},{"$f":"IFERROR(VLOOKUP(BD7,Mondphasen!$G$23:$H$36,2,FALSE),\"\")","v":""},40,"2026-11-04",46330,"2026-11-04",{"$f":"IFERROR(VLOOKUP(BJ7,Feiertage!$A$3:$B$29,2,FALSE),\"\")","v":""},{"$f":"IFERROR(VLOOKUP(BJ7,Mondphasen!$G$23:$H$36,2,FALSE),\"\")","v":""},45,"2026-12-04",46360,"2026-12-04",{"$f":"IFERROR(VLOOKUP(BP7,Feiertage!$A$3:$B$29,2,FALSE),\"\")","v":""},{"$f":"IFERROR(VLOOKUP(BP7,Mondphasen!$G$23:$H$36,2,FALSE),\"\")","v":""},49]
["2026-01-05",46027,"2026-01-05",{"$f":"IFERROR(VLOOKUP(B8,Feiertage!$A$3:$B$29,2,FALSE),\"\")","v":""},{"$f":"IFERROR(VLOOKUP(B8,Mondphasen!$G$23:$H$36,2,FALSE),\"\")","v":""},2,"2026-02-05",46058,"2026-02-05",{"$f":"IFERROR(VLOOKUP(H8,Feiertage!$A$3:$B$29,2,FALSE),\"\")","v":""},{"$f":"IFERROR(VLOOKUP(H8,Mondphasen!$G$23:$H$36,2,FALSE),\"\")","v":""},6,"2026-03-05",46086,"2026-03-05",{"$f":"IFERROR(VLOOKUP(N8,Feiertage!$A$3:$B$29,2,FALSE),\"\")","v":""},{"$f":"IFERROR(VLOOKUP(N8,Mondphasen!$G$23:$H$36,2,FALSE),\"\")","v":""},10,"2026-04-05",46117,"2026-04-05",{"$f":"IFERROR(VLOOKUP(T8,Feiertage!$A$3:$B$29,2,FALSE),\"\")","v":"Ostersonntag"},{"$f":"IFERROR(VLOOKUP(T8,Mondphasen!$G$23:$H$36,2,FALSE),\"\")","v":""},14,"2026-05-05",46147,"2026-05-05",{"$f":"IFERROR(VLOOKUP(Z8,Feiertage!$A$3:$B$29,2,FALSE),\"\")","v":""},{"$f":"IFERROR(VLOOKUP(Z8,Mondphasen!$G$23:$H$36,2,FALSE),\"\")","v":""},19,"2026-06-05",46178,"2026-06-05",{"$f":"IFERROR(VLOOKUP(AF8,Feiertage!$A$3:$B$29,2,FALSE),\"\")","v":""},{"$f":"IFERROR(VLOOKUP(AF8,Mondphasen!$G$23:$H$36,2,FALSE),\"\")","v":""},23,"2026-07-05",46208,"2026-07-05",{"$f":"IFERROR(VLOOKUP(AL8,Feiertage!$A$3:$B$29,2,FALSE),\"\")","v":""},{"$f":"IFERROR(VLOOKUP(AL8,Mondphasen!$G$23:$H$36,2,FALSE),\"\")","v":""},27,"2026-08-05",46239,"2026-08-05",{"$f":"IFERROR(VLOOKUP(AR8,Feiertage!$A$3:$B$29,2,FALSE),\"\")","v":""},{"$f":"IFERROR(VLOOKUP(AR8,Mondphasen!$G$23:$H$36,2,FALSE),\"\")","v":""},32,"2026-09-05",46270,"2026-09-05",{"$f":"IFERROR(VLOOKUP(AX8,Feiertage!$A$3:$B$29,2,FALSE),\"\")","v":""},{"$f":"IFERROR(VLOOKUP(AX8,Mondphasen!$G$23:$H$36,2,FALSE),\"\")","v":""},36,"2026-10-05",46300,"2026-10-05",{"$f":"IFERROR(VLOOKUP(BD8,Feiertage!$A$3:$B$29,2,FALSE),\"\")","v":""},{"$f":"IFERROR(VLOOKUP(BD8,Mondphasen!$G$23:$H$36,2,FALSE),\"\")","v":""},41,"2026-11-05",46331,"2026-11-05",{"$f":"IFERROR(VLOOKUP(BJ8,Feiertage!$A$3:$B$29,2,FALSE),\"\")","v":""},{"$f":"IFERROR(VLOOKUP(BJ8,Mondphasen!$G$23:$H$36,2,FALSE),\"\")","v":""},45,"2026-12-05",46361,"2026-12-05",{"$f":"IFERROR(VLOOKUP(BP8,Feiertage!$A$3:$B$29,2,FALSE),\"\")","v":""},{"$f":"IFERROR(VLOOKUP(BP8,Mondphasen!$G$23:$H$36,2,FALSE),\"\")","v":""},49]
["2026-01-06",46028,"2026-01-06",{"$f":"IFERROR(VLOOKUP(B9,Feiertage!$A$3:$B$29,2,FALSE),\"\")","v":"Heilige drei Könige"},{"$f":"IFERROR(VLOOKUP(B9,Mondphasen!$G$23:$H$36,2,FALSE),\"\")","v":""},2,"2026-02-06",46059,"2026-02-06",{"$f":"IFERROR(VLOOKUP(H9,Feiertage!$A$3:$B$29,2,FALSE),\"\")","v":""},{"$f":"IFERROR(VLOOKUP(H9,Mondphasen!$G$23:$H$36,2,FALSE),\"\")","v":""},6,"2026-03-06",46087,"2026-03-06",{"$f":"IFERROR(VLOOKUP(N9,Feiertage!$A$3:$B$29,2,FALSE),\"\")","v":""},{"$f":"IFERROR(VLOOKUP(N9,Mondphasen!$G$23:$H$36,2,FALSE),\"\")","v":""},10,"2026-04-06",46118,"2026-04-06",{"$f":"IFERROR(VLOOKUP(T9,Feiertage!$A$3:$B$29,2,FALSE),\"\")","v":"Ostermontag"},{"$f":"IFERROR(VLOOKUP(T9,Mondphasen!$G$23:$H$36,2,FALSE),\"\")","v":""},15,"2026-05-06",46148,"2026-05-06",{"$f":"IFERROR(VLOOKUP(Z9,Feiertage!$A$3:$B$29,2,FALSE),\"\")","v":""},{"$f":"IFERROR(VLOOKUP(Z9,Mondphasen!$G$23:$H$36,2,FALSE),\"\")","v":""},19,"2026-06-06",46179,"2026-06-06",{"$f":"IFERROR(VLOOKUP(AF9,Feiertage!$A$3:$B$29,2,FALSE),\"\")","v":""},{"$f":"IFERROR(VLOOKUP(AF9,Mondphasen!$G$23:$H$36,2,FALSE),\"\")","v":""},23,"2026-07-06",46209,"2026-07-06",{"$f":"IFERROR(VLOOKUP(AL9,Feiertage!$A$3:$B$29,2,FALSE),\"\")","v":""},{"$f":"IFERROR(VLOOKUP(AL9,Mondphasen!$G$23:$H$36,2,FALSE),\"\")","v":""},28,"2026-08-06",46240,"2026-08-06",{"$f":"IFERROR(VLOOKUP(AR9,Feiertage!$A$3:$B$29,2,FALSE),\"\")","v":""},{"$f":"IFERROR(VLOOKUP(AR9,Mondphasen!$G$23:$H$36,2,FALSE),\"\")","v":""},32,"2026-09-06",46271,"2026-09-06",{"$f":"IFERROR(VLOOKUP(AX9,Feiertage!$A$3:$B$29,2,FALSE),\"\")","v":""},{"$f":"IFERROR(VLOOKUP(AX9,Mondphasen!$G$23:$H$36,2,FALSE),\"\")","v":""},36,"2026-10-06",46301,"2026-10-06",{"$f":"IFERROR(VLOOKUP(BD9,Feiertage!$A$3:$B$29,2,FALSE),\"\")","v":""},{"$f":"IFERROR(VLOOKUP(BD9,Mondphasen!$G$23:$H$36,2,FALSE),\"\")","v":""},41,"2026-11-06",46332,"2026-11-06",{"$f":"IFERROR(VLOOKUP(BJ9,Feiertage!$A$3:$B$29,2,FALSE),\"\")","v":""},{"$f":"IFERROR(VLOOKUP(BJ9,Mondphasen!$G$23:$H$36,2,FALSE),\"\")","v":""},45,"2026-12-06",46362,"2026-12-06",{"$f":"IFERROR(VLOOKUP(BP9,Feiertage!$A$3:$B$29,2,FALSE),\"\")","v":"Samichlaus"},{"$f":"IFERROR(VLOOKUP(BP9,Mondphasen!$G$23:$H$36,2,FALSE),\"\")","v":""},49]
["2026-01-07",46029,"2026-01-07",{"$f":"IFERROR(VLOOKUP(B10,Feiertage!$A$3:$B$29,2,FALSE),\"\")","v":""},{"$f":"IFERROR(VLOOKUP(B10,Mondphasen!$G$23:$H$36,2,FALSE),\"\")","v":""},2,"2026-02-07",46060,"2026-02-07",{"$f":"IFERROR(VLOOKUP(H10,Feiertage!$A$3:$B$29,2,FALSE),\"\")","v":""},{"$f":"IFERROR(VLOOKUP(H10,Mondphasen!$G$23:$H$36,2,FALSE),\"\")","v":""},6,"2026-03-07",46088,"2026-03-07",{"$f":"IFERROR(VLOOKUP(N10,Feiertage!$A$3:$B$29,2,FALSE),\"\")","v":""},{"$f":"IFERROR(VLOOKUP(N10,Mondphasen!$G$23:$H$36,2,FALSE),\"\")","v":""},10,"2026-04-07",46119,"2026-04-07",{"$f":"IFERROR(VLOOKUP(T10,Feiertage!$A$3:$B$29,2,FALSE),\"\")","v":""},{"$f":"IFERROR(VLOOKUP(T10,Mondphasen!$G$23:$H$36,2,FALSE),\"\")","v":""},15,"2026-05-07",46149,"2026-05-07",{"$f":"IFERROR(VLOOKUP(Z10,Feiertage!$A$3:$B$29,2,FALSE),\"\")","v":""},{"$f":"IFERROR(VLOOKUP(Z10,Mondphasen!$G$23:$H$36,2,FALSE),\"\")","v":""},19,"2026-06-07",46180,"2026-06-07",{"$f":"IFERROR(VLOOKUP(AF10,Feiertage!$A$3:$B$29,2,FALSE),\"\")","v":""},{"$f":"IFERROR(VLOOKUP(AF10,Mondphasen!$G$23:$H$36,2,FALSE),\"\")","v":""},23,"2026-07-07",46210,"2026-07-07",{"$f":"IFERROR(VLOOKUP(AL10,Feiertage!$A$3:$B$29,2,FALSE),\"\")","v":""},{"$f":"IFERROR(VLOOKUP(AL10,Mondphasen!$G$23:$H$36,2,FALSE),\"\")","v":""},28,"2026-08-07",46241,"2026-08-07",{"$f":"IFERROR(VLOOKUP(AR10,Feiertage!$A$3:$B$29,2,FALSE),\"\")","v":""},{"$f":"IFERROR(VLOOKUP(AR10,Mondphasen!$G$23:$H$36,2,FALSE),\"\")","v":""},32,"2026-09-07",46272,"2026-09-07",{"$f":"IFERROR(VLOOKUP(AX10,Feiertage!$A$3:$B$29,2,FALSE),\"\")","v":""},{"$f":"IFERROR(VLOOKUP(AX10,Mondphasen!$G$23:$H$36,2,FALSE),\"\")","v":""},37,"2026-10-07",46302,"2026-10-07",{"$f":"IFERROR(VLOOKUP(BD10,Feiertage!$A$3:$B$29,2,FALSE),\"\")","v":""},{"$f":"IFERROR(VLOOKUP(BD10,Mondphasen!$G$23:$H$36,2,FALSE),\"\")","v":""},41,"2026-11-07",46333,"2026-11-07",{"$f":"IFERROR(VLOOKUP(BJ10,Feiertage!$A$3:$B$29,2,FALSE),\"\")","v":""},{"$f":"IFERROR(VLOOKUP(BJ10,Mondphasen!$G$23:$H$36,2,FALSE),\"\")","v":""},45,"2026-12-07",46363,"2026-12-07",{"$f":"IFERROR(VLOOKUP(BP10,Feiertage!$A$3:$B$29,2,FALSE),\"\")","v":""},{"$f":"IFERROR(VLOOKUP(BP10,Mondphasen!$G$23:$H$36,2,FALSE),\"\")","v":""},50]
["2026-01-08",46030,"2026-01-08",{"$f":"IFERROR(VLOOKUP(B11,Feiertage!$A$3:$B$29,2,FALSE),\"\")","v":""},{"$f":"IFERROR(VLOOKUP(B11,Mondphasen!$G$23:$H$36,2,FALSE),\"\")","v":""},2,"2026-02-08",46061,"2026-02-08",{"$f":"IFERROR(VLOOKUP(H11,Feiertage!$A$3:$B$29,2,FALSE),\"\")","v":""},{"$f":"IFERROR(VLOOKUP(H11,Mondphasen!$G$23:$H$36,2,FALSE),\"\")","v":""},6,"2026-03-08",46089,"2026-03-08",{"$f":"IFERROR(VLOOKUP(N11,Feiertage!$A$3:$B$29,2,FALSE),\"\")","v":""},{"$f":"IFERROR(VLOOKUP(N11,Mondphasen!$G$23:$H$36,2,FALSE),\"\")","v":""},10,"2026-04-08",46120,"2026-04-08",{"$f":"IFERROR(VLOOKUP(T11,Feiertage!$A$3:$B$29,2,FALSE),\"\")","v":""},{"$f":"IFERROR(VLOOKUP(T11,Mondphasen!$G$23:$H$36,2,FALSE),\"\")","v":""},15,"2026-05-08",46150,"2026-05-08",{"$f":"IFERROR(VLOOKUP(Z11,Feiertage!$A$3:$B$29,2,FALSE),\"\")","v":""},{"$f":"IFERROR(VLOOKUP(Z11,Mondphasen!$G$23:$H$36,2,FALSE),\"\")","v":""},19,"2026-06-08",46181,"2026-06-08",{"$f":"IFERROR(VLOOKUP(AF11,Feiertage!$A$3:$B$29,2,FALSE),\"\")","v":""},{"$f":"IFERROR(VLOOKUP(AF11,Mondphasen!$G$23:$H$36,2,FALSE),\"\")","v":""},24,"2026-07-08",46211,"2026-07-08",{"$f":"IFERROR(VLOOKUP(AL11,Feiertage!$A$3:$B$29,2,FALSE),\"\")","v":""},{"$f":"IFERROR(VLOOKUP(AL11,Mondphasen!$G$23:$H$36,2,FALSE),\"\")","v":""},28,"2026-08-08",46242,"2026-08-08",{"$f":"IFERROR(VLOOKUP(AR11,Feiertage!$A$3:$B$29,2,FALSE),\"\")","v":""},{"$f":"IFERROR(VLOOKUP(AR11,Mondphasen!$G$23:$H$36,2,FALSE),\"\")","v":""},32,"2026-09-08",46273,"2026-09-08",{"$f":"IFERROR(VLOOKUP(AX11,Feiertage!$A$3:$B$29,2,FALSE),\"\")","v":""},{"$f":"IFERROR(VLOOKUP(AX11,Mondphasen!$G$23:$H$36,2,FALSE),\"\")","v":""},37,"2026-10-08",46303,"2026-10-08",{"$f":"IFERROR(VLOOKUP(BD11,Feiertage!$A$3:$B$29,2,FALSE),\"\")","v":""},{"$f":"IFERROR(VLOOKUP(BD11,Mondphasen!$G$23:$H$36,2,FALSE),\"\")","v":""},41,"2026-11-08",46334,"2026-11-08",{"$f":"IFERROR(VLOOKUP(BJ11,Feiertage!$A$3:$B$29,2,FALSE),\"\")","v":""},{"$f":"IFERROR(VLOOKUP(BJ11,Mondphasen!$G$23:$H$36,2,FALSE),\"\")","v":""},45,"2026-12-08",46364,"2026-12-08",{"$f":"IFERROR(VLOOKUP(BP11,Feiertage!$A$3:$B$29,2,FALSE),\"\")","v":""},{"$f":"IFERROR(VLOOKUP(BP11,Mondphasen!$G$23:$H$36,2,FALSE),\"\")","v":""},50]
["2026-01-09",46031,"2026-01-09",{"$f":"IFERROR(VLOOKUP(B12,Feiertage!$A$3:$B$29,2,FALSE),\"\")","v":""},{"$f":"IFERROR(VLOOKUP(B12,Mondphasen!$G$23:$H$36,2,FALSE),\"\")","v":""},2,"2026-02-09",46062,"2026-02-09",{"$f":"IFERROR(VLOOKUP(H12,Feiertage!$A$3:$B$29,2,FALSE),\"\")","v":""},{"$f":"IFERROR(VLOOKUP(H12,Mondphasen!$G$23:$H$36,2,FALSE),\"\")","v":""},7,"2026-03-09",46090,"2026-03-09",{"$f":"IFERROR(VLOOKUP(N12,Feiertage!$A$3:$B$29,2,FALSE),\"\")","v":""},{"$f":"IFERROR(VLOOKUP(N12,Mondphasen!$G$23:$H$36,2,FALSE),\"\")","v":""},11,"2026-04-09",46121,"2026-04-09",{"$f":"IFERROR(VLOOKUP(T12,Feiertage!$A$3:$B$29,2,FALSE),\"\")","v":""},{"$f":"IFERROR(VLOOKUP(T12,Mondphasen!$G$23:$H$36,2,FALSE),\"\")","v":""},15,"2026-05-09",46151,"2026-05-09",{"$f":"IFERROR(VLOOKUP(Z12,Feiertage!$A$3:$B$29,2,FALSE),\"\")","v":""},{"$f":"IFERROR(VLOOKUP(Z12,Mondphasen!$G$23:$H$36,2,FALSE),\"\")","v":""},19,"2026-06-09",46182,"2026-06-09",{"$f":"IFERROR(VLOOKUP(AF12,Feiertage!$A$3:$B$29,2,FALSE),\"\")","v":""},{"$f":"IFERROR(VLOOKUP(AF12,Mondphasen!$G$23:$H$36,2,FALSE),\"\")","v":""},24,"2026-07-09",46212,"2026-07-09",{"$f":"IFERROR(VLOOKUP(AL12,Feiertage!$A$3:$B$29,2,FALSE),\"\")","v":""},{"$f":"IFERROR(VLOOKUP(AL12,Mondphasen!$G$23:$H$36,2,FALSE),\"\")","v":""},28,"2026-08-09",46243,"2026-08-09",{"$f":"IFERROR(VLOOKUP(AR12,Feiertage!$A$3:$B$29,2,FALSE),\"\")","v":""},{"$f":"IFERROR(VLOOKUP(AR12,Mondphasen!$G$23:$H$36,2,FALSE),\"\")","v":""},32,"2026-09-09",46274,"2026-09-09",{"$f":"IFERROR(VLOOKUP(AX12,Feiertage!$A$3:$B$29,2,FALSE),\"\")","v":""},{"$f":"IFERROR(VLOOKUP(AX12,Mondphasen!$G$23:$H$36,2,FALSE),\"\")","v":""},37,"2026-10-09",46304,"2026-10-09",{"$f":"IFERROR(VLOOKUP(BD12,Feiertage!$A$3:$B$29,2,FALSE),\"\")","v":""},{"$f":"IFERROR(VLOOKUP(BD12,Mondphasen!$G$23:$H$36,2,FALSE),\"\")","v":""},41,"2026-11-09",46335,"2026-11-09",{"$f":"IFERROR(VLOOKUP(BJ12,Feiertage!$A$3:$B$29,2,FALSE),\"\")","v":""},{"$f":"IFERROR(VLOOKUP(BJ12,Mondphasen!$G$23:$H$36,2,FALSE),\"\")","v":""},46,"2026-12-09",46365,"2026-12-09",{"$f":"IFERROR(VLOOKUP(BP12,Feiertage!$A$3:$B$29,2,FALSE),\"\")","v":""},{"$f":"IFERROR(VLOOKUP(BP12,Mondphasen!$G$23:$H$36,2,FALSE),\"\")","v":""},50]
["2026-01-10",46032,"2026-01-10",{"$f":"IFERROR(VLOOKUP(B13,Feiertage!$A$3:$B$29,2,FALSE),\"\")","v":""},{"$f":"IFERROR(VLOOKUP(B13,Mondphasen!$G$23:$H$36,2,FALSE),\"\")","v":""},2,"2026-02-10",46063,"2026-02-10",{"$f":"IFERROR(VLOOKUP(H13,Feiertage!$A$3:$B$29,2,FALSE),\"\")","v":""},{"$f":"IFERROR(VLOOKUP(H13,Mondphasen!$G$23:$H$36,2,FALSE),\"\")","v":""},7,"2026-03-10",46091,"2026-03-10",{"$f":"IFERROR(VLOOKUP(N13,Feiertage!$A$3:$B$29,2,FALSE),\"\")","v":""},{"$f":"IFERROR(VLOOKUP(N13,Mondphasen!$G$23:$H$36,2,FALSE),\"\")","v":""},11,"2026-04-10",46122,"2026-04-10",{"$f":"IFERROR(VLOOKUP(T13,Feiertage!$A$3:$B$29,2,FALSE),\"\")","v":""},{"$f":"IFERROR(VLOOKUP(T13,Mondphasen!$G$23:$H$36,2,FALSE),\"\")","v":""},15,"2026-05-10",46152,"2026-05-10",{"$f":"IFERROR(VLOOKUP(Z13,Feiertage!$A$3:$B$29,2,FALSE),\"\")","v":"Muttertag"},{"$f":"IFERROR(VLOOKUP(Z13,Mondphasen!$G$23:$H$36,2,FALSE),\"\")","v":""},19,"2026-06-10",46183,"2026-06-10",{"$f":"IFERROR(VLOOKUP(AF13,Feiertage!$A$3:$B$29,2,FALSE),\"\")","v":""},{"$f":"IFERROR(VLOOKUP(AF13,Mondphasen!$G$23:$H$36,2,FALSE),\"\")","v":""},24,"2026-07-10",46213,"2026-07-10",{"$f":"IFERROR(VLOOKUP(AL13,Feiertage!$A$3:$B$29,2,FALSE),\"\")","v":""},{"$f":"IFERROR(VLOOKUP(AL13,Mondphasen!$G$23:$H$36,2,FALSE),\"\")","v":""},28,"2026-08-10",46244,"2026-08-10",{"$f":"IFERROR(VLOOKUP(AR13,Feiertage!$A$3:$B$29,2,FALSE),\"\")","v":""},{"$f":"IFERROR(VLOOKUP(AR13,Mondphasen!$G$23:$H$36,2,FALSE),\"\")","v":""},33,"2026-09-10",46275,"2026-09-10",{"$f":"IFERROR(VLOOKUP(AX13,Feiertage!$A$3:$B$29,2,FALSE),\"\")","v":""},{"$f":"IFERROR(VLOOKUP(AX13,Mondphasen!$G$23:$H$36,2,FALSE),\"\")","v":""},37,"2026-10-10",46305,"2026-10-10",{"$f":"IFERROR(VLOOKUP(BD13,Feiertage!$A$3:$B$29,2,FALSE),\"\")","v":""},{"$f":"IFERROR(VLOOKUP(BD13,Mondphasen!$G$23:$H$36,2,FALSE),\"\")","v":""},41,"2026-11-10",46336,"2026-11-10",{"$f":"IFERROR(VLOOKUP(BJ13,Feiertage!$A$3:$B$29,2,FALSE),\"\")","v":""},{"$f":"IFERROR(VLOOKUP(BJ13,Mondphasen!$G$23:$H$36,2,FALSE),\"\")","v":""},46,"2026-12-10",46366,"2026-12-10",{"$f":"IFERROR(VLOOKUP(BP13,Feiertage!$A$3:$B$29,2,FALSE),\"\")","v":""},{"$f":"IFERROR(VLOOKUP(BP13,Mondphasen!$G$23:$H$36,2,FALSE),\"\")","v":""},50]
["2026-01-11",46033,"2026-01-11",{"$f":"IFERROR(VLOOKUP(B14,Feiertage!$A$3:$B$29,2,FALSE),\"\")","v":""},{"$f":"IFERROR(VLOOKUP(B14,Mondphasen!$G$23:$H$36,2,FALSE),\"\")","v":""},2,"2026-02-11",46064,"2026-02-11",{"$f":"IFERROR(VLOOKUP(H14,Feiertage!$A$3:$B$29,2,FALSE),\"\")","v":""},{"$f":"IFERROR(VLOOKUP(H14,Mondphasen!$G$23:$H$36,2,FALSE),\"\")","v":""},7,"2026-03-11",46092,"2026-03-11",{"$f":"IFERROR(VLOOKUP(N14,Feiertage!$A$3:$B$29,2,FALSE),\"\")","v":""},{"$f":"IFERROR(VLOOKUP(N14,Mondphasen!$G$23:$H$36,2,FALSE),\"\")","v":""},11,"2026-04-11",46123,"2026-04-11",{"$f":"IFERROR(VLOOKUP(T14,Feiertage!$A$3:$B$29,2,FALSE),\"\")","v":""},{"$f":"IFERROR(VLOOKUP(T14,Mondphasen!$G$23:$H$36,2,FALSE),\"\")","v":""},15,"2026-05-11",46153,"2026-05-11",{"$f":"IFERROR(VLOOKUP(Z14,Feiertage!$A$3:$B$29,2,FALSE),\"\")","v":""},{"$f":"IFERROR(VLOOKUP(Z14,Mondphasen!$G$23:$H$36,2,FALSE),\"\")","v":""},20,"2026-06-11",46184,"2026-06-11",{"$f":"IFERROR(VLOOKUP(AF14,Feiertage!$A$3:$B$29,2,FALSE),\"\")","v":""},{"$f":"IFERROR(VLOOKUP(AF14,Mondphasen!$G$23:$H$36,2,FALSE),\"\")","v":""},24,"2026-07-11",46214,"2026-07-11",{"$f":"IFERROR(VLOOKUP(AL14,Feiertage!$A$3:$B$29,2,FALSE),\"\")","v":""},{"$f":"IFERROR(VLOOKUP(AL14,Mondphasen!$G$23:$H$36,2,FALSE),\"\")","v":""},28,"2026-08-11",46245,"2026-08-11",{"$f":"IFERROR(VLOOKUP(AR14,Feiertage!$A$3:$B$29,2,FALSE),\"\")","v":""},{"$f":"IFERROR(VLOOKUP(AR14,Mondphasen!$G$23:$H$36,2,FALSE),\"\")","v":""},33,"2026-09-11",46276,"2026-09-11",{"$f":"IFERROR(VLOOKUP(AX14,Feiertage!$A$3:$B$29,2,FALSE),\"\")","v":""},{"$f":"IFERROR(VLOOKUP(AX14,Mondphasen!$G$23:$H$36,2,FALSE),\"\")","v":""},37,"2026-10-11",46306,"2026-10-11",{"$f":"IFERROR(VLOOKUP(BD14,Feiertage!$A$3:$B$29,2,FALSE),\"\")","v":""},{"$f":"IFERROR(VLOOKUP(BD14,Mondphasen!$G$23:$H$36,2,FALSE),\"\")","v":""},41,"2026-11-11",46337,"2026-11-11",{"$f":"IFERROR(VLOOKUP(BJ14,Feiertage!$A$3:$B$29,2,FALSE),\"\")","v":""},{"$f":"IFERROR(VLOOKUP(BJ14,Mondphasen!$G$23:$H$36,2,FALSE),\"\")","v":""},46,"2026-12-11",46367,"2026-12-11",{"$f":"IFERROR(VLOOKUP(BP14,Feiertage!$A$3:$B$29,2,FALSE),\"\")","v":""},{"$f":"IFERROR(VLOOKUP(BP14,Mondphasen!$G$23:$H$36,2,FALSE),\"\")","v":""},50]
["2026-01-12",46034,"2026-01-12",{"$f":"IFERROR(VLOOKUP(B15,Feiertage!$A$3:$B$29,2,FALSE),\"\")","v":""},{"$f":"IFERROR(VLOOKUP(B15,Mondphasen!$G$23:$H$36,2,FALSE),\"\")","v":""},3,"2026-02-12",46065,"2026-02-12",{"$f":"IFERROR(VLOOKUP(H15,Feiertage!$A$3:$B$29,2,FALSE),\"\")","v":""},{"$f":"IFERROR(VLOOKUP(H15,Mondphasen!$G$23:$H$36,2,FALSE),\"\")","v":""},7,"2026-03-12",46093,"2026-03-12",{"$f":"IFERROR(VLOOKUP(N15,Feiertage!$A$3:$B$29,2,FALSE),\"\")","v":""},{"$f":"IFERROR(VLOOKUP(N15,Mondphasen!$G$23:$H$36,2,FALSE),\"\")","v":""},11,"2026-04-12",46124,"2026-04-12",{"$f":"IFERROR(VLOOKUP(T15,Feiertage!$A$3:$B$29,2,FALSE),\"\")","v":""},{"$f":"IFERROR(VLOOKUP(T15,Mondphasen!$G$23:$H$36,2,FALSE),\"\")","v":""},15,"2026-05-12",46154,"2026-05-12",{"$f":"IFERROR(VLOOKUP(Z15,Feiertage!$A$3:$B$29,2,FALSE),\"\")","v":""},{"$f":"IFERROR(VLOOKUP(Z15,Mondphasen!$G$23:$H$36,2,FALSE),\"\")","v":""},20,"2026-06-12",46185,"2026-06-12",{"$f":"IFERROR(VLOOKUP(AF15,Feiertage!$A$3:$B$29,2,FALSE),\"\")","v":""},{"$f":"IFERROR(VLOOKUP(AF15,Mondphasen!$G$23:$H$36,2,FALSE),\"\")","v":""},24,"2026-07-12",46215,"2026-07-12",{"$f":"IFERROR(VLOOKUP(AL15,Feiertage!$A$3:$B$29,2,FALSE),\"\")","v":""},{"$f":"IFERROR(VLOOKUP(AL15,Mondphasen!$G$23:$H$36,2,FALSE),\"\")","v":""},28,"2026-08-12",46246,"2026-08-12",{"$f":"IFERROR(VLOOKUP(AR15,Feiertage!$A$3:$B$29,2,FALSE),\"\")","v":""},{"$f":"IFERROR(VLOOKUP(AR15,Mondphasen!$G$23:$H$36,2,FALSE),\"\")","v":""},33,"2026-09-12",46277,"2026-09-12",{"$f":"IFERROR(VLOOKUP(AX15,Feiertage!$A$3:$B$29,2,FALSE),\"\")","v":""},{"$f":"IFERROR(VLOOKUP(AX15,Mondphasen!$G$23:$H$36,2,FALSE),\"\")","v":""},37,"2026-10-12",46307,"2026-10-12",{"$f":"IFERROR(VLOOKUP(BD15,Feiertage!$A$3:$B$29,2,FALSE),\"\")","v":""},{"$f":"IFERROR(VLOOKUP(BD15,Mondphasen!$G$23:$H$36,2,FALSE),\"\")","v":""},42,"2026-11-12",46338,"2026-11-12",{"$f":"IFERROR(VLOOKUP(BJ15,Feiertage!$A$3:$B$29,2,FALSE),\"\")","v":""},{"$f":"IFERROR(VLOOKUP(BJ15,Mondphasen!$G$23:$H$36,2,FALSE),\"\")","v":""},46,"2026-12-12",46368,"2026-12-12",{"$f":"IFERROR(VLOOKUP(BP15,Feiertage!$A$3:$B$29,2,FALSE),\"\")","v":""},{"$f":"IFERROR(VLOOKUP(BP15,Mondphasen!$G$23:$H$36,2,FALSE),\"\")","v":""},50]
["2026-01-13",46035,"2026-01-13",{"$f":"IFERROR(VLOOKUP(B16,Feiertage!$A$3:$B$29,2,FALSE),\"\")","v":""},{"$f":"IFERROR(VLOOKUP(B16,Mondphasen!$G$23:$H$36,2,FALSE),\"\")","v":""},3,"2026-02-13",46066,"2026-02-13",{"$f":"IFERROR(VLOOKUP(H16,Feiertage!$A$3:$B$29,2,FALSE),\"\")","v":""},{"$f":"IFERROR(VLOOKUP(H16,Mondphasen!$G$23:$H$36,2,FALSE),\"\")","v":""},7,"2026-03-13",46094,"2026-03-13",{"$f":"IFERROR(VLOOKUP(N16,Feiertage!$A$3:$B$29,2,FALSE),\"\")","v":""},{"$f":"IFERROR(VLOOKUP(N16,Mondphasen!$G$23:$H$36,2,FALSE),\"\")","v":""},11,"2026-04-13",46125,"2026-04-13",{"$f":"IFERROR(VLOOKUP(T16,Feiertage!$A$3:$B$29,2,FALSE),\"\")","v":""},{"$f":"IFERROR(VLOOKUP(T16,Mondphasen!$G$23:$H$36,2,FALSE),\"\")","v":""},16,"2026-05-13",46155,"2026-05-13",{"$f":"IFERROR(VLOOKUP(Z16,Feiertage!$A$3:$B$29,2,FALSE),\"\")","v":""},{"$f":"IFERROR(VLOOKUP(Z16,Mondphasen!$G$23:$H$36,2,FALSE),\"\")","v":""},20,"2026-06-13",46186,"2026-06-13",{"$f":"IFERROR(VLOOKUP(AF16,Feiertage!$A$3:$B$29,2,FALSE),\"\")","v":""},{"$f":"IFERROR(VLOOKUP(AF16,Mondphasen!$G$23:$H$36,2,FALSE),\"\")","v":""},24,"2026-07-13",46216,"2026-07-13",{"$f":"IFERROR(VLOOKUP(AL16,Feiertage!$A$3:$B$29,2,FALSE),\"\")","v":""},{"$f":"IFERROR(VLOOKUP(AL16,Mondphasen!$G$23:$H$36,2,FALSE),\"\")","v":""},29,"2026-08-13",46247,"2026-08-13",{"$f":"IFERROR(VLOOKUP(AR16,Feiertage!$A$3:$B$29,2,FALSE),\"\")","v":""},{"$f":"IFERROR(VLOOKUP(AR16,Mondphasen!$G$23:$H$36,2,FALSE),\"\")","v":""},33,"2026-09-13",46278,"2026-09-13",{"$f":"IFERROR(VLOOKUP(AX16,Feiertage!$A$3:$B$29,2,FALSE),\"\")","v":""},{"$f":"IFERROR(VLOOKUP(AX16,Mondphasen!$G$23:$H$36,2,FALSE),\"\")","v":""},37,"2026-10-13",46308,"2026-10-13",{"$f":"IFERROR(VLOOKUP(BD16,Feiertage!$A$3:$B$29,2,FALSE),\"\")","v":""},{"$f":"IFERROR(VLOOKUP(BD16,Mondphasen!$G$23:$H$36,2,FALSE),\"\")","v":""},42,"2026-11-13",46339,"2026-11-13",{"$f":"IFERROR(VLOOKUP(BJ16,Feiertage!$A$3:$B$29,2,FALSE),\"\")","v":""},{"$f":"IFERROR(VLOOKUP(BJ16,Mondphasen!$G$23:$H$36,2,FALSE),\"\")","v":""},46,"2026-12-13",46369,"2026-12-13",{"$f":"IFERROR(VLOOKUP(BP16,Feiertage!$A$3:$B$29,2,FALSE),\"\")","v":""},{"$f":"IFERROR(VLOOKUP(BP16,Mondphasen!$G$23:$H$36,2,FALSE),\"\")","v":""},50]
["2026-01-14",46036,"2026-01-14",{"$f":"IFERROR(VLOOKUP(B17,Feiertage!$A$3:$B$29,2,FALSE),\"\")","v":""},{"$f":"IFERROR(VLOOKUP(B17,Mondphasen!$G$23:$H$36,2,FALSE),\"\")","v":""},3,"2026-02-14",46067,"2026-02-14",{"$f":"IFERROR(VLOOKUP(H17,Feiertage!$A$3:$B$29,2,FALSE),\"\")","v":""},{"$f":"IFERROR(VLOOKUP(H17,Mondphasen!$G$23:$H$36,2,FALSE),\"\")","v":""},7,"2026-03-14",46095,"2026-03-14",{"$f":"IFERROR(VLOOKUP(N17,Feiertage!$A$3:$B$29,2,FALSE),\"\")","v":""},{"$f":"IFERROR(VLOOKUP(N17,Mondphasen!$G$23:$H$36,2,FALSE),\"\")","v":""},11,"2026-04-14",46126,"2026-04-14",{"$f":"IFERROR(VLOOKUP(T17,Feiertage!$A$3:$B$29,2,FALSE),\"\")","v":""},{"$f":"IFERROR(VLOOKUP(T17,Mondphasen!$G$23:$H$36,2,FALSE),\"\")","v":""},16,"2026-05-14",46156,"2026-05-14",{"$f":"IFERROR(VLOOKUP(Z17,Feiertage!$A$3:$B$29,2,FALSE),\"\")","v":"Auffahrt"},{"$f":"IFERROR(VLOOKUP(Z17,Mondphasen!$G$23:$H$36,2,FALSE),\"\")","v":""},20,"2026-06-14",46187,"2026-06-14",{"$f":"IFERROR(VLOOKUP(AF17,Feiertage!$A$3:$B$29,2,FALSE),\"\")","v":""},{"$f":"IFERROR(VLOOKUP(AF17,Mondphasen!$G$23:$H$36,2,FALSE),\"\")","v":""},24,"2026-07-14",46217,"2026-07-14",{"$f":"IFERROR(VLOOKUP(AL17,Feiertage!$A$3:$B$29,2,FALSE),\"\")","v":""},{"$f":"IFERROR(VLOOKUP(AL17,Mondphasen!$G$23:$H$36,2,FALSE),\"\")","v":""},29,"2026-08-14",46248,"2026-08-14",{"$f":"IFERROR(VLOOKUP(AR17,Feiertage!$A$3:$B$29,2,FALSE),\"\")","v":""},{"$f":"IFERROR(VLOOKUP(AR17,Mondphasen!$G$23:$H$36,2,FALSE),\"\")","v":""},33,"2026-09-14",46279,"2026-09-14",{"$f":"IFERROR(VLOOKUP(AX17,Feiertage!$A$3:$B$29,2,FALSE),\"\")","v":""},{"$f":"IFERROR(VLOOKUP(AX17,Mondphasen!$G$23:$H$36,2,FALSE),\"\")","v":""},38,"2026-10-14",46309,"2026-10-14",{"$f":"IFERROR(VLOOKUP(BD17,Feiertage!$A$3:$B$29,2,FALSE),\"\")","v":""},{"$f":"IFERROR(VLOOKUP(BD17,Mondphasen!$G$23:$H$36,2,FALSE),\"\")","v":""},42,"2026-11-14",46340,"2026-11-14",{"$f":"IFERROR(VLOOKUP(BJ17,Feiertage!$A$3:$B$29,2,FALSE),\"\")","v":""},{"$f":"IFERROR(VLOOKUP(BJ17,Mondphasen!$G$23:$H$36,2,FALSE),\"\")","v":""},46,"2026-12-14",46370,"2026-12-14",{"$f":"IFERROR(VLOOKUP(BP17,Feiertage!$A$3:$B$29,2,FALSE),\"\")","v":""},{"$f":"IFERROR(VLOOKUP(BP17,Mondphasen!$G$23:$H$36,2,FALSE),\"\")","v":""},51]
["2026-01-15",46037,"2026-01-15",{"$f":"IFERROR(VLOOKUP(B18,Feiertage!$A$3:$B$29,2,FALSE),\"\")","v":""},{"$f":"IFERROR(VLOOKUP(B18,Mondphasen!$G$23:$H$36,2,FALSE),\"\")","v":""},3,"2026-02-15",46068,"2026-02-15",{"$f":"IFERROR(VLOOKUP(H18,Feiertage!$A$3:$B$29,2,FALSE),\"\")","v":""},{"$f":"IFERROR(VLOOKUP(H18,Mondphasen!$G$23:$H$36,2,FALSE),\"\")","v":""},7,"2026-03-15",46096,"2026-03-15",{"$f":"IFERROR(VLOOKUP(N18,Feiertage!$A$3:$B$29,2,FALSE),\"\")","v":""},{"$f":"IFERROR(VLOOKUP(N18,Mondphasen!$G$23:$H$36,2,FALSE),\"\")","v":""},11,"2026-04-15",46127,"2026-04-15",{"$f":"IFERROR(VLOOKUP(T18,Feiertage!$A$3:$B$29,2,FALSE),\"\")","v":""},{"$f":"IFERROR(VLOOKUP(T18,Mondphasen!$G$23:$H$36,2,FALSE),\"\")","v":""},16,"2026-05-15",46157,"2026-05-15",{"$f":"IFERROR(VLOOKUP(Z18,Feiertage!$A$3:$B$29,2,FALSE),\"\")","v":""},{"$f":"IFERROR(VLOOKUP(Z18,Mondphasen!$G$23:$H$36,2,FALSE),\"\")","v":""},20,"2026-06-15",46188,"2026-06-15",{"$f":"IFERROR(VLOOKUP(AF18,Feiertage!$A$3:$B$29,2,FALSE),\"\")","v":""},{"$f":"IFERROR(VLOOKUP(AF18,Mondphasen!$G$23:$H$36,2,FALSE),\"\")","v":""},25,"2026-07-15",46218,"2026-07-15",{"$f":"IFERROR(VLOOKUP(AL18,Feiertage!$A$3:$B$29,2,FALSE),\"\")","v":""},{"$f":"IFERROR(VLOOKUP(AL18,Mondphasen!$G$23:$H$36,2,FALSE),\"\")","v":""},29,"2026-08-15",46249,"2026-08-15",{"$f":"IFERROR(VLOOKUP(AR18,Feiertage!$A$3:$B$29,2,FALSE),\"\")","v":"Maria-Himmelfahrt"},{"$f":"IFERROR(VLOOKUP(AR18,Mondphasen!$G$23:$H$36,2,FALSE),\"\")","v":""},33,"2026-09-15",46280,"2026-09-15",{"$f":"IFERROR(VLOOKUP(AX18,Feiertage!$A$3:$B$29,2,FALSE),\"\")","v":""},{"$f":"IFERROR(VLOOKUP(AX18,Mondphasen!$G$23:$H$36,2,FALSE),\"\")","v":""},38,"2026-10-15",46310,"2026-10-15",{"$f":"IFERROR(VLOOKUP(BD18,Feiertage!$A$3:$B$29,2,FALSE),\"\")","v":""},{"$f":"IFERROR(VLOOKUP(BD18,Mondphasen!$G$23:$H$36,2,FALSE),\"\")","v":""},42,"2026-11-15",46341,"2026-11-15",{"$f":"IFERROR(VLOOKUP(BJ18,Feiertage!$A$3:$B$29,2,FALSE),\"\")","v":""},{"$f":"IFERROR(VLOOKUP(BJ18,Mondphasen!$G$23:$H$36,2,FALSE),\"\")","v":""},46,"2026-12-15",46371,"2026-12-15",{"$f":"IFERROR(VLOOKUP(BP18,Feiertage!$A$3:$B$29,2,FALSE),\"\")","v":""},{"$f":"IFERROR(VLOOKUP(BP18,Mondphasen!$G$23:$H$36,2,FALSE),\"\")","v":""},51]
["2026-01-16",46038,"2026-01-16",{"$f":"IFERROR(VLOOKUP(B19,Feiertage!$A$3:$B$29,2,FALSE),\"\")","v":""},{"$f":"IFERROR(VLOOKUP(B19,Mondphasen!$G$23:$H$36,2,FALSE),\"\")","v":""},3,"2026-02-16",46069,"2026-02-16",{"$f":"IFERROR(VLOOKUP(H19,Feiertage!$A$3:$B$29,2,FALSE),\"\")","v":"Fasnacht-Montag"},{"$f":"IFERROR(VLOOKUP(H19,Mondphasen!$G$23:$H$36,2,FALSE),\"\")","v":""},8,"2026-03-16",46097,"2026-03-16",{"$f":"IFERROR(VLOOKUP(N19,Feiertage!$A$3:$B$29,2,FALSE),\"\")","v":""},{"$f":"IFERROR(VLOOKUP(N19,Mondphasen!$G$23:$H$36,2,FALSE),\"\")","v":""},12,"2026-04-16",46128,"2026-04-16",{"$f":"IFERROR(VLOOKUP(T19,Feiertage!$A$3:$B$29,2,FALSE),\"\")","v":""},{"$f":"IFERROR(VLOOKUP(T19,Mondphasen!$G$23:$H$36,2,FALSE),\"\")","v":""},16,"2026-05-16",46158,"2026-05-16",{"$f":"IFERROR(VLOOKUP(Z19,Feiertage!$A$3:$B$29,2,FALSE),\"\")","v":""},{"$f":"IFERROR(VLOOKUP(Z19,Mondphasen!$G$23:$H$36,2,FALSE),\"\")","v":""},20,"2026-06-16",46189,"2026-06-16",{"$f":"IFERROR(VLOOKUP(AF19,Feiertage!$A$3:$B$29,2,FALSE),\"\")","v":""},{"$f":"IFERROR(VLOOKUP(AF19,Mondphasen!$G$23:$H$36,2,FALSE),\"\")","v":""},25,"2026-07-16",46219,"2026-07-16",{"$f":"IFERROR(VLOOKUP(AL19,Feiertage!$A$3:$B$29,2,FALSE),\"\")","v":""},{"$f":"IFERROR(VLOOKUP(AL19,Mondphasen!$G$23:$H$36,2,FALSE),\"\")","v":""},29,"2026-08-16",46250,"2026-08-16",{"$f":"IFERROR(VLOOKUP(AR19,Feiertage!$A$3:$B$29,2,FALSE),\"\")","v":""},{"$f":"IFERROR(VLOOKUP(AR19,Mondphasen!$G$23:$H$36,2,FALSE),\"\")","v":""},33,"2026-09-16",46281,"2026-09-16",{"$f":"IFERROR(VLOOKUP(AX19,Feiertage!$A$3:$B$29,2,FALSE),\"\")","v":""},{"$f":"IFERROR(VLOOKUP(AX19,Mondphasen!$G$23:$H$36,2,FALSE),\"\")","v":""},38,"2026-10-16",46311,"2026-10-16",{"$f":"IFERROR(VLOOKUP(BD19,Feiertage!$A$3:$B$29,2,FALSE),\"\")","v":""},{"$f":"IFERROR(VLOOKUP(BD19,Mondphasen!$G$23:$H$36,2,FALSE),\"\")","v":""},42,"2026-11-16",46342,"2026-11-16",{"$f":"IFERROR(VLOOKUP(BJ19,Feiertage!$A$3:$B$29,2,FALSE),\"\")","v":""},{"$f":"IFERROR(VLOOKUP(BJ19,Mondphasen!$G$23:$H$36,2,FALSE),\"\")","v":""},47,"2026-12-16",46372,"2026-12-16",{"$f":"IFERROR(VLOOKUP(BP19,Feiertage!$A$3:$B$29,2,FALSE),\"\")","v":""},{"$f":"IFERROR(VLOOKUP(BP19,Mondphasen!$G$23:$H$36,2,FALSE),\"\")","v":""},51]
["2026-01-17",46039,"2026-01-17",{"$f":"IFERROR(VLOOKUP(B20,Feiertage!$A$3:$B$29,2,FALSE),\"\")","v":""},{"$f":"IFERROR(VLOOKUP(B20,Mondphasen!$G$23:$H$36,2,FALSE),\"\")","v":""},3,"2026-02-17",46070,"2026-02-17",{"$f":"IFERROR(VLOOKUP(H20,Feiertage!$A$3:$B$29,2,FALSE),\"\")","v":"Fasnacht-Dienstag"},{"$f":"IFERROR(VLOOKUP(H20,Mondphasen!$G$23:$H$36,2,FALSE),\"\")","v":""},8,"2026-03-17",46098,"2026-03-17",{"$f":"IFERROR(VLOOKUP(N20,Feiertage!$A$3:$B$29,2,FALSE),\"\")","v":""},{"$f":"IFERROR(VLOOKUP(N20,Mondphasen!$G$23:$H$36,2,FALSE),\"\")","v":""},12,"2026-04-17",46129,"2026-04-17",{"$f":"IFERROR(VLOOKUP(T20,Feiertage!$A$3:$B$29,2,FALSE),\"\")","v":""},{"$f":"IFERROR(VLOOKUP(T20,Mondphasen!$G$23:$H$36,2,FALSE),\"\")","v":""},16,"2026-05-17",46159,"2026-05-17",{"$f":"IFERROR(VLOOKUP(Z20,Feiertage!$A$3:$B$29,2,FALSE),\"\")","v":""},{"$f":"IFERROR(VLOOKUP(Z20,Mondphasen!$G$23:$H$36,2,FALSE),\"\")","v":""},20,"2026-06-17",46190,"2026-06-17",{"$f":"IFERROR(VLOOKUP(AF20,Feiertage!$A$3:$B$29,2,FALSE),\"\")","v":""},{"$f":"IFERROR(VLOOKUP(AF20,Mondphasen!$G$23:$H$36,2,FALSE),\"\")","v":""},25,"2026-07-17",46220,"2026-07-17",{"$f":"IFERROR(VLOOKUP(AL20,Feiertage!$A$3:$B$29,2,FALSE),\"\")","v":""},{"$f":"IFERROR(VLOOKUP(AL20,Mondphasen!$G$23:$H$36,2,FALSE),\"\")","v":""},29,"2026-08-17",46251,"2026-08-17",{"$f":"IFERROR(VLOOKUP(AR20,Feiertage!$A$3:$B$29,2,FALSE),\"\")","v":""},{"$f":"IFERROR(VLOOKUP(AR20,Mondphasen!$G$23:$H$36,2,FALSE),\"\")","v":""},34,"2026-09-17",46282,"2026-09-17",{"$f":"IFERROR(VLOOKUP(AX20,Feiertage!$A$3:$B$29,2,FALSE),\"\")","v":""},{"$f":"IFERROR(VLOOKUP(AX20,Mondphasen!$G$23:$H$36,2,FALSE),\"\")","v":""},38,"2026-10-17",46312,"2026-10-17",{"$f":"IFERROR(VLOOKUP(BD20,Feiertage!$A$3:$B$29,2,FALSE),\"\")","v":""},{"$f":"IFERROR(VLOOKUP(BD20,Mondphasen!$G$23:$H$36,2,FALSE),\"\")","v":""},42,"2026-11-17",46343,"2026-11-17",{"$f":"IFERROR(VLOOKUP(BJ20,Feiertage!$A$3:$B$29,2,FALSE),\"\")","v":""},{"$f":"IFERROR(VLOOKUP(BJ20,Mondphasen!$G$23:$H$36,2,FALSE),\"\")","v":""},47,"2026-12-17",46373,"2026-12-17",{"$f":"IFERROR(VLOOKUP(BP20,Feiertage!$A$3:$B$29,2,FALSE),\"\")","v":""},{"$f":"IFERROR(VLOOKUP(BP20,Mondphasen!$G$23:$H$36,2,FALSE),\"\")","v":""},51]
["2026-01-18",46040,"2026-01-18",{"$f":"IFERROR(VLOOKUP(B21,Feiertage!$A$3:$B$29,2,FALSE),\"\")","v":""},{"$f":"IFERROR(VLOOKUP(B21,Mondphasen!$G$23:$H$36,2,FALSE),\"\")","v":""},3,"2026-02-18",46071,"2026-02-18",{"$f":"IFERROR(VLOOKUP(H21,Feiertage!$A$3:$B$29,2,FALSE),\"\")","v":"Aschermittwoch"},{"$f":"IFERROR(VLOOKUP(H21,Mondphasen!$G$23:$H$36,2,FALSE),\"\")","v":""},8,"2026-03-18",46099,"2026-03-18",{"$f":"IFERROR(VLOOKUP(N21,Feiertage!$A$3:$B$29,2,FALSE),\"\")","v":""},{"$f":"IFERROR(VLOOKUP(N21,Mondphasen!$G$23:$H$36,2,FALSE),\"\")","v":""},12,"2026-04-18",46130,"2026-04-18",{"$f":"IFERROR(VLOOKUP(T21,Feiertage!$A$3:$B$29,2,FALSE),\"\")","v":""},{"$f":"IFERROR(VLOOKUP(T21,Mondphasen!$G$23:$H$36,2,FALSE),\"\")","v":""},16,"2026-05-18",46160,"2026-05-18",{"$f":"IFERROR(VLOOKUP(Z21,Feiertage!$A$3:$B$29,2,FALSE),\"\")","v":""},{"$f":"IFERROR(VLOOKUP(Z21,Mondphasen!$G$23:$H$36,2,FALSE),\"\")","v":""},21,"2026-06-18",46191,"2026-06-18",{"$f":"IFERROR(VLOOKUP(AF21,Feiertage!$A$3:$B$29,2,FALSE),\"\")","v":""},{"$f":"IFERROR(VLOOKUP(AF21,Mondphasen!$G$23:$H$36,2,FALSE),\"\")","v":""},25,"2026-07-18",46221,"2026-07-18",{"$f":"IFERROR(VLOOKUP(AL21,Feiertage!$A$3:$B$29,2,FALSE),\"\")","v":""},{"$f":"IFERROR(VLOOKUP(AL21,Mondphasen!$G$23:$H$36,2,FALSE),\"\")","v":""},29,"2026-08-18",46252,"2026-08-18",{"$f":"IFERROR(VLOOKUP(AR21,Feiertage!$A$3:$B$29,2,FALSE),\"\")","v":""},{"$f":"IFERROR(VLOOKUP(AR21,Mondphasen!$G$23:$H$36,2,FALSE),\"\")","v":""},34,"2026-09-18",46283,"2026-09-18",{"$f":"IFERROR(VLOOKUP(AX21,Feiertage!$A$3:$B$29,2,FALSE),\"\")","v":""},{"$f":"IFERROR(VLOOKUP(AX21,Mondphasen!$G$23:$H$36,2,FALSE),\"\")","v":""},38,"2026-10-18",46313,"2026-10-18",{"$f":"IFERROR(VLOOKUP(BD21,Feiertage!$A$3:$B$29,2,FALSE),\"\")","v":""},{"$f":"IFERROR(VLOOKUP(BD21,Mondphasen!$G$23:$H$36,2,FALSE),\"\")","v":""},42,"2026-11-18",46344,"2026-11-18",{"$f":"IFERROR(VLOOKUP(BJ21,Feiertage!$A$3:$B$29,2,FALSE),\"\")","v":""},{"$f":"IFERROR(VLOOKUP(BJ21,Mondphasen!$G$23:$H$36,2,FALSE),\"\")","v":""},47,"2026-12-18",46374,"2026-12-18",{"$f":"IFERROR(VLOOKUP(BP21,Feiertage!$A$3:$B$29,2,FALSE),\"\")","v":""},{"$f":"IFERROR(VLOOKUP(BP21,Mondphasen!$G$23:$H$36,2,FALSE),\"\")","v":""},51]
["2026-01-19",46041,"2026-01-19",{"$f":"IFERROR(VLOOKUP(B22,Feiertage!$A$3:$B$29,2,FALSE),\"\")","v":""},{"$f":"IFERROR(VLOOKUP(B22,Mondphasen!$G$23:$H$36,2,FALSE),\"\")","v":""},4,"2026-02-19",46072,"2026-02-19",{"$f":"IFERROR(VLOOKUP(H22,Feiertage!$A$3:$B$29,2,FALSE),\"\")","v":""},{"$f":"IFERROR(VLOOKUP(H22,Mondphasen!$G$23:$H$36,2,FALSE),\"\")","v":""},8,"2026-03-19",46100,"2026-03-19",{"$f":"IFERROR(VLOOKUP(N22,Feiertage!$A$3:$B$29,2,FALSE),\"\")","v":""},{"$f":"IFERROR(VLOOKUP(N22,Mondphasen!$G$23:$H$36,2,FALSE),\"\")","v":""},12,"2026-04-19",46131,"2026-04-19",{"$f":"IFERROR(VLOOKUP(T22,Feiertage!$A$3:$B$29,2,FALSE),\"\")","v":""},{"$f":"IFERROR(VLOOKUP(T22,Mondphasen!$G$23:$H$36,2,FALSE),\"\")","v":""},16,"2026-05-19",46161,"2026-05-19",{"$f":"IFERROR(VLOOKUP(Z22,Feiertage!$A$3:$B$29,2,FALSE),\"\")","v":""},{"$f":"IFERROR(VLOOKUP(Z22,Mondphasen!$G$23:$H$36,2,FALSE),\"\")","v":""},21,"2026-06-19",46192,"2026-06-19",{"$f":"IFERROR(VLOOKUP(AF22,Feiertage!$A$3:$B$29,2,FALSE),\"\")","v":""},{"$f":"IFERROR(VLOOKUP(AF22,Mondphasen!$G$23:$H$36,2,FALSE),\"\")","v":""},25,"2026-07-19",46222,"2026-07-19",{"$f":"IFERROR(VLOOKUP(AL22,Feiertage!$A$3:$B$29,2,FALSE),\"\")","v":""},{"$f":"IFERROR(VLOOKUP(AL22,Mondphasen!$G$23:$H$36,2,FALSE),\"\")","v":""},29,"2026-08-19",46253,"2026-08-19",{"$f":"IFERROR(VLOOKUP(AR22,Feiertage!$A$3:$B$29,2,FALSE),\"\")","v":""},{"$f":"IFERROR(VLOOKUP(AR22,Mondphasen!$G$23:$H$36,2,FALSE),\"\")","v":""},34,"2026-09-19",46284,"2026-09-19",{"$f":"IFERROR(VLOOKUP(AX22,Feiertage!$A$3:$B$29,2,FALSE),\"\")","v":""},{"$f":"IFERROR(VLOOKUP(AX22,Mondphasen!$G$23:$H$36,2,FALSE),\"\")","v":""},38,"2026-10-19",46314,"2026-10-19",{"$f":"IFERROR(VLOOKUP(BD22,Feiertage!$A$3:$B$29,2,FALSE),\"\")","v":""},{"$f":"IFERROR(VLOOKUP(BD22,Mondphasen!$G$23:$H$36,2,FALSE),\"\")","v":""},43,"2026-11-19",46345,"2026-11-19",{"$f":"IFERROR(VLOOKUP(BJ22,Feiertage!$A$3:$B$29,2,FALSE),\"\")","v":""},{"$f":"IFERROR(VLOOKUP(BJ22,Mondphasen!$G$23:$H$36,2,FALSE),\"\")","v":""},47,"2026-12-19",46375,"2026-12-19",{"$f":"IFERROR(VLOOKUP(BP22,Feiertage!$A$3:$B$29,2,FALSE),\"\")","v":""},{"$f":"IFERROR(VLOOKUP(BP22,Mondphasen!$G$23:$H$36,2,FALSE),\"\")","v":""},51]
["2026-01-20",46042,"2026-01-20",{"$f":"IFERROR(VLOOKUP(B23,Feiertage!$A$3:$B$29,2,FALSE),\"\")","v":""},{"$f":"IFERROR(VLOOKUP(B23,Mondphasen!$G$23:$H$36,2,FALSE),\"\")","v":""},4,"2026-02-20",46073,"2026-02-20",{"$f":"IFERROR(VLOOKUP(H23,Feiertage!$A$3:$B$29,2,FALSE),\"\")","v":""},{"$f":"IFERROR(VLOOKUP(H23,Mondphasen!$G$23:$H$36,2,FALSE),\"\")","v":""},8,"2026-03-20",46101,"2026-03-20",{"$f":"IFERROR(VLOOKUP(N23,Feiertage!$A$3:$B$29,2,FALSE),\"\")","v":""},{"$f":"IFERROR(VLOOKUP(N23,Mondphasen!$G$23:$H$36,2,FALSE),\"\")","v":""},12,"2026-04-20",46132,"2026-04-20",{"$f":"IFERROR(VLOOKUP(T23,Feiertage!$A$3:$B$29,2,FALSE),\"\")","v":""},{"$f":"IFERROR(VLOOKUP(T23,Mondphasen!$G$23:$H$36,2,FALSE),\"\")","v":""},17,"2026-05-20",46162,"2026-05-20",{"$f":"IFERROR(VLOOKUP(Z23,Feiertage!$A$3:$B$29,2,FALSE),\"\")","v":""},{"$f":"IFERROR(VLOOKUP(Z23,Mondphasen!$G$23:$H$36,2,FALSE),\"\")","v":""},21,"2026-06-20",46193,"2026-06-20",{"$f":"IFERROR(VLOOKUP(AF23,Feiertage!$A$3:$B$29,2,FALSE),\"\")","v":""},{"$f":"IFERROR(VLOOKUP(AF23,Mondphasen!$G$23:$H$36,2,FALSE),\"\")","v":""},25,"2026-07-20",46223,"2026-07-20",{"$f":"IFERROR(VLOOKUP(AL23,Feiertage!$A$3:$B$29,2,FALSE),\"\")","v":""},{"$f":"IFERROR(VLOOKUP(AL23,Mondphasen!$G$23:$H$36,2,FALSE),\"\")","v":""},30,"2026-08-20",46254,"2026-08-20",{"$f":"IFERROR(VLOOKUP(AR23,Feiertage!$A$3:$B$29,2,FALSE),\"\")","v":""},{"$f":"IFERROR(VLOOKUP(AR23,Mondphasen!$G$23:$H$36,2,FALSE),\"\")","v":""},34,"2026-09-20",46285,"2026-09-20",{"$f":"IFERROR(VLOOKUP(AX23,Feiertage!$A$3:$B$29,2,FALSE),\"\")","v":"Eidg. Buß und Bettag"},{"$f":"IFERROR(VLOOKUP(AX23,Mondphasen!$G$23:$H$36,2,FALSE),\"\")","v":""},38,"2026-10-20",46315,"2026-10-20",{"$f":"IFERROR(VLOOKUP(BD23,Feiertage!$A$3:$B$29,2,FALSE),\"\")","v":""},{"$f":"IFERROR(VLOOKUP(BD23,Mondphasen!$G$23:$H$36,2,FALSE),\"\")","v":""},43,"2026-11-20",46346,"2026-11-20",{"$f":"IFERROR(VLOOKUP(BJ23,Feiertage!$A$3:$B$29,2,FALSE),\"\")","v":""},{"$f":"IFERROR(VLOOKUP(BJ23,Mondphasen!$G$23:$H$36,2,FALSE),\"\")","v":""},47,"2026-12-20",46376,"2026-12-20",{"$f":"IFERROR(VLOOKUP(BP23,Feiertage!$A$3:$B$29,2,FALSE),\"\")","v":""},{"$f":"IFERROR(VLOOKUP(BP23,Mondphasen!$G$23:$H$36,2,FALSE),\"\")","v":""},51]
["2026-01-21",46043,"2026-01-21",{"$f":"IFERROR(VLOOKUP(B24,Feiertage!$A$3:$B$29,2,FALSE),\"\")","v":""},{"$f":"IFERROR(VLOOKUP(B24,Mondphasen!$G$23:$H$36,2,FALSE),\"\")","v":""},4,"2026-02-21",46074,"2026-02-21",{"$f":"IFERROR(VLOOKUP(H24,Feiertage!$A$3:$B$29,2,FALSE),\"\")","v":""},{"$f":"IFERROR(VLOOKUP(H24,Mondphasen!$G$23:$H$36,2,FALSE),\"\")","v":""},8,"2026-03-21",46102,"2026-03-21",{"$f":"IFERROR(VLOOKUP(N24,Feiertage!$A$3:$B$29,2,FALSE),\"\")","v":""},{"$f":"IFERROR(VLOOKUP(N24,Mondphasen!$G$23:$H$36,2,FALSE),\"\")","v":""},12,"2026-04-21",46133,"2026-04-21",{"$f":"IFERROR(VLOOKUP(T24,Feiertage!$A$3:$B$29,2,FALSE),\"\")","v":""},{"$f":"IFERROR(VLOOKUP(T24,Mondphasen!$G$23:$H$36,2,FALSE),\"\")","v":""},17,"2026-05-21",46163,"2026-05-21",{"$f":"IFERROR(VLOOKUP(Z24,Feiertage!$A$3:$B$29,2,FALSE),\"\")","v":""},{"$f":"IFERROR(VLOOKUP(Z24,Mondphasen!$G$23:$H$36,2,FALSE),\"\")","v":""},21,"2026-06-21",46194,"2026-06-21",{"$f":"IFERROR(VLOOKUP(AF24,Feiertage!$A$3:$B$29,2,FALSE),\"\")","v":""},{"$f":"IFERROR(VLOOKUP(AF24,Mondphasen!$G$23:$H$36,2,FALSE),\"\")","v":""},25,"2026-07-21",46224,"2026-07-21",{"$f":"IFERROR(VLOOKUP(AL24,Feiertage!$A$3:$B$29,2,FALSE),\"\")","v":""},{"$f":"IFERROR(VLOOKUP(AL24,Mondphasen!$G$23:$H$36,2,FALSE),\"\")","v":""},30,"2026-08-21",46255,"2026-08-21",{"$f":"IFERROR(VLOOKUP(AR24,Feiertage!$A$3:$B$29,2,FALSE),\"\")","v":""},{"$f":"IFERROR(VLOOKUP(AR24,Mondphasen!$G$23:$H$36,2,FALSE),\"\")","v":""},34,"2026-09-21",46286,"2026-09-21",{"$f":"IFERROR(VLOOKUP(AX24,Feiertage!$A$3:$B$29,2,FALSE),\"\")","v":""},{"$f":"IFERROR(VLOOKUP(AX24,Mondphasen!$G$23:$H$36,2,FALSE),\"\")","v":""},39,"2026-10-21",46316,"2026-10-21",{"$f":"IFERROR(VLOOKUP(BD24,Feiertage!$A$3:$B$29,2,FALSE),\"\")","v":""},{"$f":"IFERROR(VLOOKUP(BD24,Mondphasen!$G$23:$H$36,2,FALSE),\"\")","v":""},43,"2026-11-21",46347,"2026-11-21",{"$f":"IFERROR(VLOOKUP(BJ24,Feiertage!$A$3:$B$29,2,FALSE),\"\")","v":""},{"$f":"IFERROR(VLOOKUP(BJ24,Mondphasen!$G$23:$H$36,2,FALSE),\"\")","v":""},47,"2026-12-21",46377,"2026-12-21",{"$f":"IFERROR(VLOOKUP(BP24,Feiertage!$A$3:$B$29,2,FALSE),\"\")","v":""},{"$f":"IFERROR(VLOOKUP(BP24,Mondphasen!$G$23:$H$36,2,FALSE),\"\")","v":""},52]
["2026-01-22",46044,"2026-01-22",{"$f":"IFERROR(VLOOKUP(B25,Feiertage!$A$3:$B$29,2,FALSE),\"\")","v":""},{"$f":"IFERROR(VLOOKUP(B25,Mondphasen!$G$23:$H$36,2,FALSE),\"\")","v":""},4,"2026-02-22",46075,"2026-02-22",{"$f":"IFERROR(VLOOKUP(H25,Feiertage!$A$3:$B$29,2,FALSE),\"\")","v":""},{"$f":"IFERROR(VLOOKUP(H25,Mondphasen!$G$23:$H$36,2,FALSE),\"\")","v":""},8,"2026-03-22",46103,"2026-03-22",{"$f":"IFERROR(VLOOKUP(N25,Feiertage!$A$3:$B$29,2,FALSE),\"\")","v":""},{"$f":"IFERROR(VLOOKUP(N25,Mondphasen!$G$23:$H$36,2,FALSE),\"\")","v":""},12,"2026-04-22",46134,"2026-04-22",{"$f":"IFERROR(VLOOKUP(T25,Feiertage!$A$3:$B$29,2,FALSE),\"\")","v":""},{"$f":"IFERROR(VLOOKUP(T25,Mondphasen!$G$23:$H$36,2,FALSE),\"\")","v":""},17,"2026-05-22",46164,"2026-05-22",{"$f":"IFERROR(VLOOKUP(Z25,Feiertage!$A$3:$B$29,2,FALSE),\"\")","v":""},{"$f":"IFERROR(VLOOKUP(Z25,Mondphasen!$G$23:$H$36,2,FALSE),\"\")","v":""},21,"2026-06-22",46195,"2026-06-22",{"$f":"IFERROR(VLOOKUP(AF25,Feiertage!$A$3:$B$29,2,FALSE),\"\")","v":""},{"$f":"IFERROR(VLOOKUP(AF25,Mondphasen!$G$23:$H$36,2,FALSE),\"\")","v":""},26,"2026-07-22",46225,"2026-07-22",{"$f":"IFERROR(VLOOKUP(AL25,Feiertage!$A$3:$B$29,2,FALSE),\"\")","v":""},{"$f":"IFERROR(VLOOKUP(AL25,Mondphasen!$G$23:$H$36,2,FALSE),\"\")","v":""},30,"2026-08-22",46256,"2026-08-22",{"$f":"IFERROR(VLOOKUP(AR25,Feiertage!$A$3:$B$29,2,FALSE),\"\")","v":""},{"$f":"IFERROR(VLOOKUP(AR25,Mondphasen!$G$23:$H$36,2,FALSE),\"\")","v":""},34,"2026-09-22",46287,"2026-09-22",{"$f":"IFERROR(VLOOKUP(AX25,Feiertage!$A$3:$B$29,2,FALSE),\"\")","v":""},{"$f":"IFERROR(VLOOKUP(AX25,Mondphasen!$G$23:$H$36,2,FALSE),\"\")","v":""},39,"2026-10-22",46317,"2026-10-22",{"$f":"IFERROR(VLOOKUP(BD25,Feiertage!$A$3:$B$29,2,FALSE),\"\")","v":""},{"$f":"IFERROR(VLOOKUP(BD25,Mondphasen!$G$23:$H$36,2,FALSE),\"\")","v":""},43,"2026-11-22",46348,"2026-11-22",{"$f":"IFERROR(VLOOKUP(BJ25,Feiertage!$A$3:$B$29,2,FALSE),\"\")","v":""},{"$f":"IFERROR(VLOOKUP(BJ25,Mondphasen!$G$23:$H$36,2,FALSE),\"\")","v":""},47,"2026-12-22",46378,"2026-12-22",{"$f":"IFERROR(VLOOKUP(BP25,Feiertage!$A$3:$B$29,2,FALSE),\"\")","v":""},{"$f":"IFERROR(VLOOKUP(BP25,Mondphasen!$G$23:$H$36,2,FALSE),\"\")","v":""},52]
["2026-01-23",46045,"2026-01-23",{"$f":"IFERROR(VLOOKUP(B26,Feiertage!$A$3:$B$29,2,FALSE),\"\")","v":""},{"$f":"IFERROR(VLOOKUP(B26,Mondphasen!$G$23:$H$36,2,FALSE),\"\")","v":""},4,"2026-02-23",46076,"2026-02-23",{"$f":"IFERROR(VLOOKUP(H26,Feiertage!$A$3:$B$29,2,FALSE),\"\")","v":""},{"$f":"IFERROR(VLOOKUP(H26,Mondphasen!$G$23:$H$36,2,FALSE),\"\")","v":""},9,"2026-03-23",46104,"2026-03-23",{"$f":"IFERROR(VLOOKUP(N26,Feiertage!$A$3:$B$29,2,FALSE),\"\")","v":""},{"$f":"IFERROR(VLOOKUP(N26,Mondphasen!$G$23:$H$36,2,FALSE),\"\")","v":""},13,"2026-04-23",46135,"2026-04-23",{"$f":"IFERROR(VLOOKUP(T26,Feiertage!$A$3:$B$29,2,FALSE),\"\")","v":""},{"$f":"IFERROR(VLOOKUP(T26,Mondphasen!$G$23:$H$36,2,FALSE),\"\")","v":""},17,"2026-05-23",46165,"2026-05-23",{"$f":"IFERROR(VLOOKUP(Z26,Feiertage!$A$3:$B$29,2,FALSE),\"\")","v":""},{"$f":"IFERROR(VLOOKUP(Z26,Mondphasen!$G$23:$H$36,2,FALSE),\"\")","v":""},21,"2026-06-23",46196,"2026-06-23",{"$f":"IFERROR(VLOOKUP(AF26,Feiertage!$A$3:$B$29,2,FALSE),\"\")","v":""},{"$f":"IFERROR(VLOOKUP(AF26,Mondphasen!$G$23:$H$36,2,FALSE),\"\")","v":""},26,"2026-07-23",46226,"2026-07-23",{"$f":"IFERROR(VLOOKUP(AL26,Feiertage!$A$3:$B$29,2,FALSE),\"\")","v":""},{"$f":"IFERROR(VLOOKUP(AL26,Mondphasen!$G$23:$H$36,2,FALSE),\"\")","v":""},30,"2026-08-23",46257,"2026-08-23",{"$f":"IFERROR(VLOOKUP(AR26,Feiertage!$A$3:$B$29,2,FALSE),\"\")","v":""},{"$f":"IFERROR(VLOOKUP(AR26,Mondphasen!$G$23:$H$36,2,FALSE),\"\")","v":""},34,"2026-09-23",46288,"2026-09-23",{"$f":"IFERROR(VLOOKUP(AX26,Feiertage!$A$3:$B$29,2,FALSE),\"\")","v":""},{"$f":"IFERROR(VLOOKUP(AX26,Mondphasen!$G$23:$H$36,2,FALSE),\"\")","v":""},39,"2026-10-23",46318,"2026-10-23",{"$f":"IFERROR(VLOOKUP(BD26,Feiertage!$A$3:$B$29,2,FALSE),\"\")","v":""},{"$f":"IFERROR(VLOOKUP(BD26,Mondphasen!$G$23:$H$36,2,FALSE),\"\")","v":""},43,"2026-11-23",46349,"2026-11-23",{"$f":"IFERROR(VLOOKUP(BJ26,Feiertage!$A$3:$B$29,2,FALSE),\"\")","v":""},{"$f":"IFERROR(VLOOKUP(BJ26,Mondphasen!$G$23:$H$36,2,FALSE),\"\")","v":""},48,"2026-12-23",46379,"2026-12-23",{"$f":"IFERROR(VLOOKUP(BP26,Feiertage!$A$3:$B$29,2,FALSE),\"\")","v":""},{"$f":"IFERROR(VLOOKUP(BP26,Mondphasen!$G$23:$H$36,2,FALSE),\"\")","v":""},52]
["2026-01-24",46046,"2026-01-24",{"$f":"IFERROR(VLOOKUP(B27,Feiertage!$A$3:$B$29,2,FALSE),\"\")","v":""},{"$f":"IFERROR(VLOOKUP(B27,Mondphasen!$G$23:$H$36,2,FALSE),\"\")","v":""},4,"2026-02-24",46077,"2026-02-24",{"$f":"IFERROR(VLOOKUP(H27,Feiertage!$A$3:$B$29,2,FALSE),\"\")","v":""},{"$f":"IFERROR(VLOOKUP(H27,Mondphasen!$G$23:$H$36,2,FALSE),\"\")","v":""},9,"2026-03-24",46105,"2026-03-24",{"$f":"IFERROR(VLOOKUP(N27,Feiertage!$A$3:$B$29,2,FALSE),\"\")","v":""},{"$f":"IFERROR(VLOOKUP(N27,Mondphasen!$G$23:$H$36,2,FALSE),\"\")","v":""},13,"2026-04-24",46136,"2026-04-24",{"$f":"IFERROR(VLOOKUP(T27,Feiertage!$A$3:$B$29,2,FALSE),\"\")","v":""},{"$f":"IFERROR(VLOOKUP(T27,Mondphasen!$G$23:$H$36,2,FALSE),\"\")","v":""},17,"2026-05-24",46166,"2026-05-24",{"$f":"IFERROR(VLOOKUP(Z27,Feiertage!$A$3:$B$29,2,FALSE),\"\")","v":"Pfingsten"},{"$f":"IFERROR(VLOOKUP(Z27,Mondphasen!$G$23:$H$36,2,FALSE),\"\")","v":""},21,"2026-06-24",46197,"2026-06-24",{"$f":"IFERROR(VLOOKUP(AF27,Feiertage!$A$3:$B$29,2,FALSE),\"\")","v":""},{"$f":"IFERROR(VLOOKUP(AF27,Mondphasen!$G$23:$H$36,2,FALSE),\"\")","v":""},26,"2026-07-24",46227,"2026-07-24",{"$f":"IFERROR(VLOOKUP(AL27,Feiertage!$A$3:$B$29,2,FALSE),\"\")","v":""},{"$f":"IFERROR(VLOOKUP(AL27,Mondphasen!$G$23:$H$36,2,FALSE),\"\")","v":""},30,"2026-08-24",46258,"2026-08-24",{"$f":"IFERROR(VLOOKUP(AR27,Feiertage!$A$3:$B$29,2,FALSE),\"\")","v":""},{"$f":"IFERROR(VLOOKUP(AR27,Mondphasen!$G$23:$H$36,2,FALSE),\"\")","v":""},35,"2026-09-24",46289,"2026-09-24",{"$f":"IFERROR(VLOOKUP(AX27,Feiertage!$A$3:$B$29,2,FALSE),\"\")","v":""},{"$f":"IFERROR(VLOOKUP(AX27,Mondphasen!$G$23:$H$36,2,FALSE),\"\")","v":""},39,"2026-10-24",46319,"2026-10-24",{"$f":"IFERROR(VLOOKUP(BD27,Feiertage!$A$3:$B$29,2,FALSE),\"\")","v":""},{"$f":"IFERROR(VLOOKUP(BD27,Mondphasen!$G$23:$H$36,2,FALSE),\"\")","v":""},43,"2026-11-24",46350,"2026-11-24",{"$f":"IFERROR(VLOOKUP(BJ27,Feiertage!$A$3:$B$29,2,FALSE),\"\")","v":""},{"$f":"IFERROR(VLOOKUP(BJ27,Mondphasen!$G$23:$H$36,2,FALSE),\"\")","v":"l"},48,"2026-12-24",46380,"2026-12-24",{"$f":"IFERROR(VLOOKUP(BP27,Feiertage!$A$3:$B$29,2,FALSE),\"\")","v":"Heilig Abend"},{"$f":"IFERROR(VLOOKUP(BP27,Mondphasen!$G$23:$H$36,2,FALSE),\"\")","v":"l"},52]
["2026-01-25",46047,"2026-01-25",{"$f":"IFERROR(VLOOKUP(B28,Feiertage!$A$3:$B$29,2,FALSE),\"\")","v":""},{"$f":"IFERROR(VLOOKUP(B28,Mondphasen!$G$23:$H$36,2,FALSE),\"\")","v":""},4,"2026-02-25",46078,"2026-02-25",{"$f":"IFERROR(VLOOKUP(H28,Feiertage!$A$3:$B$29,2,FALSE),\"\")","v":""},{"$f":"IFERROR(VLOOKUP(H28,Mondphasen!$G$23:$H$36,2,FALSE),\"\")","v":""},9,"2026-03-25",46106,"2026-03-25",{"$f":"IFERROR(VLOOKUP(N28,Feiertage!$A$3:$B$29,2,FALSE),\"\")","v":""},{"$f":"IFERROR(VLOOKUP(N28,Mondphasen!$G$23:$H$36,2,FALSE),\"\")","v":""},13,"2026-04-25",46137,"2026-04-25",{"$f":"IFERROR(VLOOKUP(T28,Feiertage!$A$3:$B$29,2,FALSE),\"\")","v":""},{"$f":"IFERROR(VLOOKUP(T28,Mondphasen!$G$23:$H$36,2,FALSE),\"\")","v":""},17,"2026-05-25",46167,"2026-05-25",{"$f":"IFERROR(VLOOKUP(Z28,Feiertage!$A$3:$B$29,2,FALSE),\"\")","v":"Pfingst-Montag"},{"$f":"IFERROR(VLOOKUP(Z28,Mondphasen!$G$23:$H$36,2,FALSE),\"\")","v":""},22,"2026-06-25",46198,"2026-06-25",{"$f":"IFERROR(VLOOKUP(AF28,Feiertage!$A$3:$B$29,2,FALSE),\"\")","v":""},{"$f":"IFERROR(VLOOKUP(AF28,Mondphasen!$G$23:$H$36,2,FALSE),\"\")","v":""},26,"2026-07-25",46228,"2026-07-25",{"$f":"IFERROR(VLOOKUP(AL28,Feiertage!$A$3:$B$29,2,FALSE),\"\")","v":""},{"$f":"IFERROR(VLOOKUP(AL28,Mondphasen!$G$23:$H$36,2,FALSE),\"\")","v":""},30,"2026-08-25",46259,"2026-08-25",{"$f":"IFERROR(VLOOKUP(AR28,Feiertage!$A$3:$B$29,2,FALSE),\"\")","v":""},{"$f":"IFERROR(VLOOKUP(AR28,Mondphasen!$G$23:$H$36,2,FALSE),\"\")","v":""},35,"2026-09-25",46290,"2026-09-25",{"$f":"IFERROR(VLOOKUP(AX28,Feiertage!$A$3:$B$29,2,FALSE),\"\")","v":""},{"$f":"IFERROR(VLOOKUP(AX28,Mondphasen!$G$23:$H$36,2,FALSE),\"\")","v":""},39,"2026-10-25",46320,"2026-10-25",{"$f":"IFERROR(VLOOKUP(BD28,Feiertage!$A$3:$B$29,2,FALSE),\"\")","v":""},{"$f":"IFERROR(VLOOKUP(BD28,Mondphasen!$G$23:$H$36,2,FALSE),\"\")","v":""},43,"2026-11-25",46351,"2026-11-25",{"$f":"IFERROR(VLOOKUP(BJ28,Feiertage!$A$3:$B$29,2,FALSE),\"\")","v":""},{"$f":"IFERROR(VLOOKUP(BJ28,Mondphasen!$G$23:$H$36,2,FALSE),\"\")","v":""},48,"2026-12-25",46381,"2026-12-25",{"$f":"IFERROR(VLOOKUP(BP28,Feiertage!$A$3:$B$29,2,FALSE),\"\")","v":"Weihnachten"},{"$f":"IFERROR(VLOOKUP(BP28,Mondphasen!$G$23:$H$36,2,FALSE),\"\")","v":""},52]
["2026-01-26",46048,"2026-01-26",{"$f":"IFERROR(VLOOKUP(B29,Feiertage!$A$3:$B$29,2,FALSE),\"\")","v":""},{"$f":"IFERROR(VLOOKUP(B29,Mondphasen!$G$23:$H$36,2,FALSE),\"\")","v":""},5,"2026-02-26",46079,"2026-02-26",{"$f":"IFERROR(VLOOKUP(H29,Feiertage!$A$3:$B$29,2,FALSE),\"\")","v":""},{"$f":"IFERROR(VLOOKUP(H29,Mondphasen!$G$23:$H$36,2,FALSE),\"\")","v":""},9,"2026-03-26",46107,"2026-03-26",{"$f":"IFERROR(VLOOKUP(N29,Feiertage!$A$3:$B$29,2,FALSE),\"\")","v":""},{"$f":"IFERROR(VLOOKUP(N29,Mondphasen!$G$23:$H$36,2,FALSE),\"\")","v":""},13,"2026-04-26",46138,"2026-04-26",{"$f":"IFERROR(VLOOKUP(T29,Feiertage!$A$3:$B$29,2,FALSE),\"\")","v":""},{"$f":"IFERROR(VLOOKUP(T29,Mondphasen!$G$23:$H$36,2,FALSE),\"\")","v":""},17,"2026-05-26",46168,"2026-05-26",{"$f":"IFERROR(VLOOKUP(Z29,Feiertage!$A$3:$B$29,2,FALSE),\"\")","v":""},{"$f":"IFERROR(VLOOKUP(Z29,Mondphasen!$G$23:$H$36,2,FALSE),\"\")","v":""},22,"2026-06-26",46199,"2026-06-26",{"$f":"IFERROR(VLOOKUP(AF29,Feiertage!$A$3:$B$29,2,FALSE),\"\")","v":""},{"$f":"IFERROR(VLOOKUP(AF29,Mondphasen!$G$23:$H$36,2,FALSE),\"\")","v":""},26,"2026-07-26",46229,"2026-07-26",{"$f":"IFERROR(VLOOKUP(AL29,Feiertage!$A$3:$B$29,2,FALSE),\"\")","v":""},{"$f":"IFERROR(VLOOKUP(AL29,Mondphasen!$G$23:$H$36,2,FALSE),\"\")","v":""},30,"2026-08-26",46260,"2026-08-26",{"$f":"IFERROR(VLOOKUP(AR29,Feiertage!$A$3:$B$29,2,FALSE),\"\")","v":""},{"$f":"IFERROR(VLOOKUP(AR29,Mondphasen!$G$23:$H$36,2,FALSE),\"\")","v":""},35,"2026-09-26",46291,"2026-09-26",{"$f":"IFERROR(VLOOKUP(AX29,Feiertage!$A$3:$B$29,2,FALSE),\"\")","v":""},{"$f":"IFERROR(VLOOKUP(AX29,Mondphasen!$G$23:$H$36,2,FALSE),\"\")","v":"l"},39,"2026-10-26",46321,"2026-10-26",{"$f":"IFERROR(VLOOKUP(BD29,Feiertage!$A$3:$B$29,2,FALSE),\"\")","v":""},{"$f":"IFERROR(VLOOKUP(BD29,Mondphasen!$G$23:$H$36,2,FALSE),\"\")","v":"l"},44,"2026-11-26",46352,"2026-11-26",{"$f":"IFERROR(VLOOKUP(BJ29,Feiertage!$A$3:$B$29,2,FALSE),\"\")","v":""},{"$f":"IFERROR(VLOOKUP(BJ29,Mondphasen!$G$23:$H$36,2,FALSE),\"\")","v":""},48,"2026-12-26",46382,"2026-12-26",{"$f":"IFERROR(VLOOKUP(BP29,Feiertage!$A$3:$B$29,2,FALSE),\"\")","v":"Stephanstag"},{"$f":"IFERROR(VLOOKUP(BP29,Mondphasen!$G$23:$H$36,2,FALSE),\"\")","v":""},52]
["2026-01-27",46049,"2026-01-27",{"$f":"IFERROR(VLOOKUP(B30,Feiertage!$A$3:$B$29,2,FALSE),\"\")","v":""},{"$f":"IFERROR(VLOOKUP(B30,Mondphasen!$G$23:$H$36,2,FALSE),\"\")","v":""},5,"2026-02-27",46080,"2026-02-27",{"$f":"IFERROR(VLOOKUP(H30,Feiertage!$A$3:$B$29,2,FALSE),\"\")","v":""},{"$f":"IFERROR(VLOOKUP(H30,Mondphasen!$G$23:$H$36,2,FALSE),\"\")","v":""},9,"2026-03-27",46108,"2026-03-27",{"$f":"IFERROR(VLOOKUP(N30,Feiertage!$A$3:$B$29,2,FALSE),\"\")","v":""},{"$f":"IFERROR(VLOOKUP(N30,Mondphasen!$G$23:$H$36,2,FALSE),\"\")","v":""},13,"2026-04-27",46139,"2026-04-27",{"$f":"IFERROR(VLOOKUP(T30,Feiertage!$A$3:$B$29,2,FALSE),\"\")","v":""},{"$f":"IFERROR(VLOOKUP(T30,Mondphasen!$G$23:$H$36,2,FALSE),\"\")","v":""},18,"2026-05-27",46169,"2026-05-27",{"$f":"IFERROR(VLOOKUP(Z30,Feiertage!$A$3:$B$29,2,FALSE),\"\")","v":""},{"$f":"IFERROR(VLOOKUP(Z30,Mondphasen!$G$23:$H$36,2,FALSE),\"\")","v":""},22,"2026-06-27",46200,"2026-06-27",{"$f":"IFERROR(VLOOKUP(AF30,Feiertage!$A$3:$B$29,2,FALSE),\"\")","v":""},{"$f":"IFERROR(VLOOKUP(AF30,Mondphasen!$G$23:$H$36,2,FALSE),\"\")","v":""},26,"2026-07-27",46230,"2026-07-27",{"$f":"IFERROR(VLOOKUP(AL30,Feiertage!$A$3:$B$29,2,FALSE),\"\")","v":""},{"$f":"IFERROR(VLOOKUP(AL30,Mondphasen!$G$23:$H$36,2,FALSE),\"\")","v":""},31,"2026-08-27",46261,"2026-08-27",{"$f":"IFERROR(VLOOKUP(AR30,Feiertage!$A$3:$B$29,2,FALSE),\"\")","v":""},{"$f":"IFERROR(VLOOKUP(AR30,Mondphasen!$G$23:$H$36,2,FALSE),\"\")","v":""},35,"2026-09-27",46292,"2026-09-27",{"$f":"IFERROR(VLOOKUP(AX30,Feiertage!$A$3:$B$29,2,FALSE),\"\")","v":""},{"$f":"IFERROR(VLOOKUP(AX30,Mondphasen!$G$23:$H$36,2,FALSE),\"\")","v":""},39,"2026-10-27",46322,"2026-10-27",{"$f":"IFERROR(VLOOKUP(BD30,Feiertage!$A$3:$B$29,2,FALSE),\"\")","v":""},{"$f":"IFERROR(VLOOKUP(BD30,Mondphasen!$G$23:$H$36,2,FALSE),\"\")","v":""},44,"2026-11-27",46353,"2026-11-27",{"$f":"IFERROR(VLOOKUP(BJ30,Feiertage!$A$3:$B$29,2,FALSE),\"\")","v":""},{"$f":"IFERROR(VLOOKUP(BJ30,Mondphasen!$G$23:$H$36,2,FALSE),\"\")","v":""},48,"2026-12-27",46383,"2026-12-27",{"$f":"IFERROR(VLOOKUP(BP30,Feiertage!$A$3:$B$29,2,FALSE),\"\")","v":""},{"$f":"IFERROR(VLOOKUP(BP30,Mondphasen!$G$23:$H$36,2,FALSE),\"\")","v":""},52]
["2026-01-28",46050,"2026-01-28",{"$f":"IFERROR(VLOOKUP(B31,Feiertage!$A$3:$B$29,2,FALSE),\"\")","v":""},{"$f":"IFERROR(VLOOKUP(B31,Mondphasen!$G$23:$H$36,2,FALSE),\"\")","v":""},5,"2026-02-28",46081,"2026-02-28",{"$f":"IFERROR(VLOOKUP(H31,Feiertage!$A$3:$B$29,2,FALSE),\"\")","v":""},{"$f":"IFERROR(VLOOKUP(H31,Mondphasen!$G$23:$H$36,2,FALSE),\"\")","v":""},9,"2026-03-28",46109,"2026-03-28",{"$f":"IFERROR(VLOOKUP(N31,Feiertage!$A$3:$B$29,2,FALSE),\"\")","v":""},{"$f":"IFERROR(VLOOKUP(N31,Mondphasen!$G$23:$H$36,2,FALSE),\"\")","v":""},13,"2026-04-28",46140,"2026-04-28",{"$f":"IFERROR(VLOOKUP(T31,Feiertage!$A$3:$B$29,2,FALSE),\"\")","v":""},{"$f":"IFERROR(VLOOKUP(T31,Mondphasen!$G$23:$H$36,2,FALSE),\"\")","v":""},18,"2026-05-28",46170,"2026-05-28",{"$f":"IFERROR(VLOOKUP(Z31,Feiertage!$A$3:$B$29,2,FALSE),\"\")","v":""},{"$f":"IFERROR(VLOOKUP(Z31,Mondphasen!$G$23:$H$36,2,FALSE),\"\")","v":""},22,"2026-06-28",46201,"2026-06-28",{"$f":"IFERROR(VLOOKUP(AF31,Feiertage!$A$3:$B$29,2,FALSE),\"\")","v":""},{"$f":"IFERROR(VLOOKUP(AF31,Mondphasen!$G$23:$H$36,2,FALSE),\"\")","v":""},26,"2026-07-28",46231,"2026-07-28",{"$f":"IFERROR(VLOOKUP(AL31,Feiertage!$A$3:$B$29,2,FALSE),\"\")","v":""},{"$f":"IFERROR(VLOOKUP(AL31,Mondphasen!$G$23:$H$36,2,FALSE),\"\")","v":""},31,"2026-08-28",46262,"2026-08-28",{"$f":"IFERROR(VLOOKUP(AR31,Feiertage!$A$3:$B$29,2,FALSE),\"\")","v":""},{"$f":"IFERROR(VLOOKUP(AR31,Mondphasen!$G$23:$H$36,2,FALSE),\"\")","v":"l"},35,"2026-09-28",46293,"2026-09-28",{"$f":"IFERROR(VLOOKUP(AX31,Feiertage!$A$3:$B$29,2,FALSE),\"\")","v":""},{"$f":"IFERROR(VLOOKUP(AX31,Mondphasen!$G$23:$H$36,2,FALSE),\"\")","v":""},40,"2026-10-28",46323,"2026-10-28",{"$f":"IFERROR(VLOOKUP(BD31,Feiertage!$A$3:$B$29,2,FALSE),\"\")","v":""},{"$f":"IFERROR(VLOOKUP(BD31,Mondphasen!$G$23:$H$36,2,FALSE),\"\")","v":""},44,"2026-11-28",46354,"2026-11-28",{"$f":"IFERROR(VLOOKUP(BJ31,Feiertage!$A$3:$B$29,2,FALSE),\"\")","v":""},{"$f":"IFERROR(VLOOKUP(BJ31,Mondphasen!$G$23:$H$36,2,FALSE),\"\")","v":""},48,"2026-12-28",46384,"2026-12-28",{"$f":"IFERROR(VLOOKUP(BP31,Feiertage!$A$3:$B$29,2,FALSE),\"\")","v":""},{"$f":"IFERROR(VLOOKUP(BP31,Mondphasen!$G$23:$H$36,2,FALSE),\"\")","v":""},53]
["2026-01-29",46051,"2026-01-29",{"$f":"IFERROR(VLOOKUP(B32,Feiertage!$A$3:$B$29,2,FALSE),\"\")","v":""},{"$f":"IFERROR(VLOOKUP(B32,Mondphasen!$G$23:$H$36,2,FALSE),\"\")","v":""},5,"","","",{"$f":"IFERROR(VLOOKUP(H32,Feiertage!$A$3:$B$29,2,FALSE),\"\")","v":""},{"$f":"IFERROR(VLOOKUP(H32,Mondphasen!$G$23:$H$36,2,FALSE),\"\")","v":""},"","2026-03-29",46110,"2026-03-29",{"$f":"IFERROR(VLOOKUP(N32,Feiertage!$A$3:$B$29,2,FALSE),\"\")","v":"Palmsonntag"},{"$f":"IFERROR(VLOOKUP(N32,Mondphasen!$G$23:$H$36,2,FALSE),\"\")","v":""},13,"2026-04-29",46141,"2026-04-29",{"$f":"IFERROR(VLOOKUP(T32,Feiertage!$A$3:$B$29,2,FALSE),\"\")","v":""},{"$f":"IFERROR(VLOOKUP(T32,Mondphasen!$G$23:$H$36,2,FALSE),\"\")","v":""},18,"2026-05-29",46171,"2026-05-29",{"$f":"IFERROR(VLOOKUP(Z32,Feiertage!$A$3:$B$29,2,FALSE),\"\")","v":""},{"$f":"IFERROR(VLOOKUP(Z32,Mondphasen!$G$23:$H$36,2,FALSE),\"\")","v":""},22,"2026-06-29",46202,"2026-06-29",{"$f":"IFERROR(VLOOKUP(AF32,Feiertage!$A$3:$B$29,2,FALSE),\"\")","v":""},{"$f":"IFERROR(VLOOKUP(AF32,Mondphasen!$G$23:$H$36,2,FALSE),\"\")","v":""},27,"2026-07-29",46232,"2026-07-29",{"$f":"IFERROR(VLOOKUP(AL32,Feiertage!$A$3:$B$29,2,FALSE),\"\")","v":""},{"$f":"IFERROR(VLOOKUP(AL32,Mondphasen!$G$23:$H$36,2,FALSE),\"\")","v":"l"},31,"2026-08-29",46263,"2026-08-29",{"$f":"IFERROR(VLOOKUP(AR32,Feiertage!$A$3:$B$29,2,FALSE),\"\")","v":""},{"$f":"IFERROR(VLOOKUP(AR32,Mondphasen!$G$23:$H$36,2,FALSE),\"\")","v":""},35,"2026-09-29",46294,"2026-09-29",{"$f":"IFERROR(VLOOKUP(AX32,Feiertage!$A$3:$B$29,2,FALSE),\"\")","v":""},{"$f":"IFERROR(VLOOKUP(AX32,Mondphasen!$G$23:$H$36,2,FALSE),\"\")","v":""},40,"2026-10-29",46324,"2026-10-29",{"$f":"IFERROR(VLOOKUP(BD32,Feiertage!$A$3:$B$29,2,FALSE),\"\")","v":""},{"$f":"IFERROR(VLOOKUP(BD32,Mondphasen!$G$23:$H$36,2,FALSE),\"\")","v":""},44,"2026-11-29",46355,"2026-11-29",{"$f":"IFERROR(VLOOKUP(BJ32,Feiertage!$A$3:$B$29,2,FALSE),\"\")","v":""},{"$f":"IFERROR(VLOOKUP(BJ32,Mondphasen!$G$23:$H$36,2,FALSE),\"\")","v":""},48,"2026-12-29",46385,"2026-12-29",{"$f":"IFERROR(VLOOKUP(BP32,Feiertage!$A$3:$B$29,2,FALSE),\"\")","v":""},{"$f":"IFERROR(VLOOKUP(BP32,Mondphasen!$G$23:$H$36,2,FALSE),\"\")","v":""},53]
["2026-01-30",46052,"2026-01-30",{"$f":"IFERROR(VLOOKUP(B33,Feiertage!$A$3:$B$29,2,FALSE),\"\")","v":""},{"$f":"IFERROR(VLOOKUP(B33,Mondphasen!$G$23:$H$36,2,FALSE),\"\")","v":""},5,"","","",{"$f":"IFERROR(VLOOKUP(H33,Feiertage!$A$3:$B$29,2,FALSE),\"\")","v":""},{"$f":"IFERROR(VLOOKUP(H33,Mondphasen!$G$23:$H$36,2,FALSE),\"\")","v":""},"","2026-03-30",46111,"2026-03-30",{"$f":"IFERROR(VLOOKUP(N33,Feiertage!$A$3:$B$29,2,FALSE),\"\")","v":""},{"$f":"IFERROR(VLOOKUP(N33,Mondphasen!$G$23:$H$36,2,FALSE),\"\")","v":""},14,"2026-04-30",46142,"2026-04-30",{"$f":"IFERROR(VLOOKUP(T33,Feiertage!$A$3:$B$29,2,FALSE),\"\")","v":""},{"$f":"IFERROR(VLOOKUP(T33,Mondphasen!$G$23:$H$36,2,FALSE),\"\")","v":""},18,"2026-05-30",46172,"2026-05-30",{"$f":"IFERROR(VLOOKUP(Z33,Feiertage!$A$3:$B$29,2,FALSE),\"\")","v":""},{"$f":"IFERROR(VLOOKUP(Z33,Mondphasen!$G$23:$H$36,2,FALSE),\"\")","v":""},22,"2026-06-30",46203,"2026-06-30",{"$f":"IFERROR(VLOOKUP(AF33,Feiertage!$A$3:$B$29,2,FALSE),\"\")","v":""},{"$f":"IFERROR(VLOOKUP(AF33,Mondphasen!$G$23:$H$36,2,FALSE),\"\")","v":"l"},27,"2026-07-30",46233,"2026-07-30",{"$f":"IFERROR(VLOOKUP(AL33,Feiertage!$A$3:$B$29,2,FALSE),\"\")","v":""},{"$f":"IFERROR(VLOOKUP(AL33,Mondphasen!$G$23:$H$36,2,FALSE),\"\")","v":""},31,"2026-08-30",46264,"2026-08-30",{"$f":"IFERROR(VLOOKUP(AR33,Feiertage!$A$3:$B$29,2,FALSE),\"\")","v":""},{"$f":"IFERROR(VLOOKUP(AR33,Mondphasen!$G$23:$H$36,2,FALSE),\"\")","v":""},35,"2026-09-30",46295,"2026-09-30",{"$f":"IFERROR(VLOOKUP(AX33,Feiertage!$A$3:$B$29,2,FALSE),\"\")","v":""},{"$f":"IFERROR(VLOOKUP(AX33,Mondphasen!$G$23:$H$36,2,FALSE),\"\")","v":""},40,"2026-10-30",46325,"2026-10-30",{"$f":"IFERROR(VLOOKUP(BD33,Feiertage!$A$3:$B$29,2,FALSE),\"\")","v":""},{"$f":"IFERROR(VLOOKUP(BD33,Mondphasen!$G$23:$H$36,2,FALSE),\"\")","v":""},44,"2026-11-30",46356,"2026-11-30",{"$f":"IFERROR(VLOOKUP(BJ33,Feiertage!$A$3:$B$29,2,FALSE),\"\")","v":""},{"$f":"IFERROR(VLOOKUP(BJ33,Mondphasen!$G$23:$H$36,2,FALSE),\"\")","v":""},49,"2026-12-30",46386,"2026-12-30",{"$f":"IFERROR(VLOOKUP(BP33,Feiertage!$A$3:$B$29,2,FALSE),\"\")","v":""},{"$f":"IFERROR(VLOOKUP(BP33,Mondphasen!$G$23:$H$36,2,FALSE),\"\")","v":""},53]
["2026-01-31",46053,"2026-01-31",{"$f":"IFERROR(VLOOKUP(B34,Feiertage!$A$3:$B$29,2,FALSE),\"\")","v":""},{"$f":"IFERROR(VLOOKUP(B34,Mondphasen!$G$23:$H$36,2,FALSE),\"\")","v":""},5,"","","",{"$f":"IFERROR(VLOOKUP(H34,Feiertage!$A$3:$B$29,2,FALSE),\"\")","v":""},{"$f":"IFERROR(VLOOKUP(H34,Mondphasen!$G$23:$H$36,2,FALSE),\"\")","v":""},"","2026-03-31",46112,"2026-03-31",{"$f":"IFERROR(VLOOKUP(N34,Feiertage!$A$3:$B$29,2,FALSE),\"\")","v":""},{"$f":"IFERROR(VLOOKUP(N34,Mondphasen!$G$23:$H$36,2,FALSE),\"\")","v":""},14,"","","",{"$f":"IFERROR(VLOOKUP(T34,Feiertage!$A$3:$B$29,2,FALSE),\"\")","v":""},{"$f":"IFERROR(VLOOKUP(T34,Mondphasen!$G$23:$H$36,2,FALSE),\"\")","v":""},"","2026-05-31",46173,"2026-05-31",{"$f":"IFERROR(VLOOKUP(Z34,Feiertage!$A$3:$B$29,2,FALSE),\"\")","v":""},{"$f":"IFERROR(VLOOKUP(Z34,Mondphasen!$G$23:$H$36,2,FALSE),\"\")","v":"l"},22,"","","",{"$f":"IFERROR(VLOOKUP(AF34,Feiertage!$A$3:$B$29,2,FALSE),\"\")","v":""},{"$f":"IFERROR(VLOOKUP(AF34,Mondphasen!$G$23:$H$36,2,FALSE),\"\")","v":""},"","2026-07-31",46234,"2026-07-31",{"$f":"IFERROR(VLOOKUP(AL34,Feiertage!$A$3:$B$29,2,FALSE),\"\")","v":""},{"$f":"IFERROR(VLOOKUP(AL34,Mondphasen!$G$23:$H$36,2,FALSE),\"\")","v":""},31,"2026-08-31",46265,"2026-08-31",{"$f":"IFERROR(VLOOKUP(AR34,Feiertage!$A$3:$B$29,2,FALSE),\"\")","v":""},{"$f":"IFERROR(VLOOKUP(AR34,Mondphasen!$G$23:$H$36,2,FALSE),\"\")","v":""},36,"","","",{"$f":"IFERROR(VLOOKUP(AX34,Feiertage!$A$3:$B$29,2,FALSE),\"\")","v":""},{"$f":"IFERROR(VLOOKUP(AX34,Mondphasen!$G$23:$H$36,2,FALSE),\"\")","v":""},"","2026-10-31",46326,"2026-10-31",{"$f":"IFERROR(VLOOKUP(BD34,Feiertage!$A$3:$B$29,2,FALSE),\"\")","v":""},{"$f":"IFERROR(VLOOKUP(BD34,Mondphasen!$G$23:$H$36,2,FALSE),\"\")","v":""},44,"","","",{"$f":"IFERROR(VLOOKUP(BJ34,Feiertage!$A$3:$B$29,2,FALSE),\"\")","v":""},{"$f":"IFERROR(VLOOKUP(BJ34,Mondphasen!$G$23:$H$36,2,FALSE),\"\")","v":""},"","2026-12-31",46387,"2026-12-31",{"$f":"IFERROR(VLOOKUP(BP34,Feiertage!$A$3:$B$29,2,FALSE),\"\")","v":"Silvester"},{"$f":"IFERROR(VLOOKUP(BP34,Mondphasen!$G$23:$H$36,2,FALSE),\"\")","v":""},53]

{"sheet":"Feiertage","index":1,"n_rows":29,"n_cols":16,"rows_kept":29,"cut":false,"hidden":false,"merged":[[1,1,1,3]]}
[{"$f":"IF(COUNTIF($P$3:$P$28,$A$2),\"Schaltjahr\",\"\")","v":""}]
[{"$f":"YEAR(Kalender!A4)","v":2026},{"$f":"A2","v":2026},null,null,"Gesetzlicher\nFeiertag",null,null,null,null,null,null,null,null,null,null,"Schaltjahre"]
[null,null,null,null,null,null,null,null,null,null,null,null,null,null,null,2020]
[{"$f":"C4","v":46023},"Neujahr",{"$f":"DATE(B2,1,1)","v":"2026-01-01"},{"$f":"WEEKDAY(C4,1)","v":"1900-01-05"},"Ja",null,{"$f":"I4","v":46023},"Neujahr",{"$f":"DATE($B$2,1,1)","v":"2026-01-01"},{"$f":"WEEKDAY(I4,1)","v":"1900-01-05"},"Ja",null,null,null,null,{"$f":"P3+4","v":2024}]
[46024,"Berchtoldstag",{"$f":"DATE(B2,1,2)","v":"2026-01-02"},"1900-01-06","Ja",null,46024,"Berchtoldstag",{"$f":"DATE($B$2,1,2)","v":"2026-01-02"},"1900-01-06","Ja",null,null,null,null,{"$f":"P4+4","v":2028}]
[46028,"Heilige drei Könige",{"$f":"DATE(B2,1,6)","v":"2026-01-06"},"1900-01-03",null,null,null,null,null,null,null,null,null,null,null,2032]
[46069,"Fasnacht-Montag",{"$f":"C13-48","v":"2026-02-16"},"1900-01-02",null,null,null,null,null,null,null,null,null,null,null,2036]
[46070,"Fasnacht-Dienstag",{"$f":"C13-47","v":"2026-02-17"},"1900-01-03",null,null,null,null,null,null,null,null,null,null,null,2040]
[46071,"Aschermittwoch",{"$f":"C13-46","v":"2026-02-18"},"1900-01-04",null,null,null,null,null,null,null,null,null,null,null,2044]
[46110,"Palmsonntag",{"$f":"C13-7","v":"2026-03-29"},"1900-01-01",null,null,null,null,null,null,null,null,null,null,null,2048]
[46114,"Grün-Donnerstag",{"$f":"C13-3","v":"2026-04-02"},"1900-01-05",null,null,null,null,null,null,null,null,null,null,null,2052]
[46115,"Karfreitag",{"$f":"C13-2","v":"2026-04-03"},"1900-01-06","Ja",null,46115,"Karfreitag",{"$f":"L13-2","v":"2026-04-03"},"1900-01-06","Ja",null,null,null,null,2056]
[46117,"Ostersonntag",{"$f":"ROUND((DAY(MINUTE(B2/38)/2+55)&\".4.\"&B2)/7,)*7-6","v":"2026-04-05"},"1900-01-01",null,null,{"$f":"L13","v":46117},"Ostersonntag",null,{"$f":"WEEKDAY(L13,1)","v":"1900-01-01"},null,{"$f":"ROUND((DAY(MINUTE($B$2/38)/2+55)&\".4.\"&$B$2)/7,)*7-6","v":"2026-04-05"},null,null,null,2060]
[46118,"Ostermontag",{"$f":"C13+1","v":"2026-04-06"},"1900-01-02","Ja",null,46118,"Ostermontag",{"$f":"L13+1","v":"2026-04-06"},"1900-01-02","Ja",null,null,null,null,2064]
[46143,"Tag der Arbeit",{"$f":"DATE(B2,5,1)","v":"2026-05-01"},"1900-01-06",null,null,null,null,null,null,null,null,null,null,null,2068]
[{"$f":"C16","v":46152},"Muttertag",{"$f":"C15+14-WEEKDAY(C15,2)","v":"2026-05-10"},{"$f":"WEEKDAY(C16,1)","v":"1900-01-01"},null,null,null,null,null,null,null,null,null,null,null,2072]
[46156,"Auffahrt",{"$f":"C13+39","v":"2026-05-14"},"1900-01-05","Ja",null,46156,"Auffahrt",{"$f":"L13+39","v":"2026-05-14"},"1900-01-05","Ja",null,null,null,null,2076]
[46166,"Pfingsten",{"$f":"C13+49","v":"2026-05-24"},"1900-01-01",null,null,null,null,null,null,null,null,null,null,null,2080]
[46167,"Pfingst-Montag",{"$f":"C13+50","v":"2026-05-25"},"1900-01-02","Ja",null,46167,"Pfingst-Montag",{"$f":"L13+50","v":"2026-05-25"},"1900-01-02","Ja",null,null,null,null,2084]
[{"$f":"C20","v":46177},"Fronleichnam",{"$f":"C13+60","v":"2026-06-04"},{"$f":"WEEKDAY(C20,1)","v":"1900-01-05"},null,null,null,null,null,null,null,null,null,null,null,2088]
[46235,"National-Feiertag CH",{"$f":"DATE(B2,8,1)","v":"2026-08-01"},"1900-01-07","Ja",null,{"$f":"I21","v":46235},"National-Feiertag CH",{"$f":"DATE($B$2,8,1)","v":"2026-08-01"},"1900-01-07","Ja",null,null,null,null,2092]
[46249,"Maria-Himmelfahrt",{"$f":"DATE(B2,8,15)","v":"2026-08-15"},"1900-01-07",null,null,null,null,null,null,null,null,null,null,null,2096]
[{"$f":"C23","v":46285},"Eidg. Buß und Bettag",{"$f":"DATE($A$2,9,1)+21-WEEKDAY(DATE($A$2,9,1),2)","v":"2026-09-20"},{"$f":"WEEKDAY(C23,1)","v":"1900-01-01"},"Ja",null,46285,"Eidg. Buß und Bettag",{"$f":"DATE($A$2,9,1)+21-WEEKDAY(DATE($A$2,9,1),2)","v":"2026-09-20"},"1900-01-01","Ja",null,null,null,null,2100]
[46362,"Samichlaus",{"$f":"DATE(B2,12,6)","v":"2026-12-06"},"1900-01-01",null,null,null,null,null,null,null,null,null,null,null,{"$f":"P23+4","v":2104}]
[46327,"Allerheiligen",{"$f":"DATE(B2,11,1)","v":"2026-11-01"},"1900-01-01",null,null,null,null,null,null,null,null,null,null,null,{"$f":"P24+4","v":2108}]
[46380,"Heilig Abend",{"$f":"DATE(B2,12,24)","v":"2026-12-24"},"1900-01-05",null,null,null,null,null,null,null,null,null,null,null,2112]
[46381,"Weihnachten",{"$f":"DATE(B2,12,25)","v":"2026-12-25"},"1900-01-06","Ja",null,46381,"Weihnachten",{"$f":"DATE($B$2,12,25)","v":"2026-12-25"},"1900-01-06","Ja",null,null,null,null,2116]
[46382,"Stephanstag",{"$f":"DATE(B2,12,26)","v":"2026-12-26"},"1900-01-07","Ja",null,46382,"Stephanstag",{"$f":"DATE($B$2,12,26)","v":"2026-12-26"},"1900-01-07","Ja",null,null,null,null,2120]
[46387,"Silvester",{"$f":"DATE(B2,12,31)","v":"2026-12-31"},"1900-01-05",null,null,null,null,null,null,null,null,null,null,null,2124]

{"sheet":"Mondphasen","index":2,"n_rows":36,"n_cols":14,"rows_kept":36,"cut":false,"hidden":false,"merged":[]}
["Jahr : ",{"$f":"Kalender!L1","v":2026}]
["Zeitzone : ",2]
[]
["Neumond"," erstes Viertel","Vollmond","letztes Viertel"]
[{"$f":"Tabelle!H1-2415018.5+Mondphasen!$B$2/24","v":"2025-12-20T03:44:35.240"},{"$f":"Tabelle!H2-2415018.5+Mondphasen!$B$2/24","v":"2025-12-27T21:11:06.544"},{"$f":"Tabelle!H3-2415018.5+Mondphasen!$B$2/24","v":"2026-01-03T12:03:54.095"},{"$f":"Tabelle!H4-2415018.5+Mondphasen!$B$2/24","v":"2026-01-10T17:49:10.327"}]
[{"$f":"Tabelle!H5-2415018.5+Mondphasen!$B$2/24","v":"2026-01-18T21:53:38.343"},{"$f":"Tabelle!H6-2415018.5+Mondphasen!$B$2/24","v":"2026-01-26T06:49:53.353"},{"$f":"Tabelle!H7-2415018.5+Mondphasen!$B$2/24","v":"2026-02-02T00:10:58.065"},{"$f":"Tabelle!H8-2415018.5+Mondphasen!$B$2/24","v":"2026-02-09T14:43:19.490"}]
[{"$f":"Tabelle!H9-2415018.5+Mondphasen!$B$2/24","v":"2026-02-17T14:02:56.538"},{"$f":"Tabelle!H10-2415018.5+Mondphasen!$B$2/24","v":"2026-02-24T14:30:23.590"},{"$f":"Tabelle!H11-2415018.5+Mondphasen!$B$2/24","v":"2026-03-03T13:40:13.285"},{"$f":"Tabelle!H12-2415018.5+Mondphasen!$B$2/24","v":"2026-03-11T11:40:09.350"}]
[{"$f":"Tabelle!H13-2415018.5+Mondphasen!$B$2/24","v":"2026-03-19T03:25:55.556"},{"$f":"Tabelle!H14-2415018.5+Mondphasen!$B$2/24","v":"2026-03-25T21:19:28.492"},{"$f":"Tabelle!H15-2415018.5+Mondphasen!$B$2/24","v":"2026-04-02T04:14:14.472"},{"$f":"Tabelle!H16-2415018.5+Mondphasen!$B$2/24","v":"2026-04-10T06:54:14.789"}]
[{"$f":"Tabelle!H17-2415018.5+Mondphasen!$B$2/24","v":"2026-04-17T13:54:42.866"},{"$f":"Tabelle!H18-2415018.5+Mondphasen!$B$2/24","v":"2026-04-24T04:33:05.836"},{"$f":"Tabelle!H19-2415018.5+Mondphasen!$B$2/24","v":"2026-05-01T19:25:23.885"},{"$f":"Tabelle!H20-2415018.5+Mondphasen!$B$2/24","v":"2026-05-09T23:12:36.949"}]
[{"$f":"Tabelle!H21-2415018.5+Mondphasen!$B$2/24","v":"2026-05-16T22:03:09.493"},{"$f":"Tabelle!H22-2415018.5+Mondphasen!$B$2/24","v":"2026-05-23T13:12:51.383"},{"$f":"Tabelle!H23-2415018.5+Mondphasen!$B$2/24","v":"2026-05-31T10:47:35.993"},{"$f":"Tabelle!H24-2415018.5+Mondphasen!$B$2/24","v":"2026-06-08T12:02:36.416"}]
[{"$f":"Tabelle!H25-2415018.5+Mondphasen!$B$2/24","v":"2026-06-15T04:55:30.156"},{"$f":"Tabelle!H26-2415018.5+Mondphasen!$B$2/24","v":"2026-06-21T23:57:07.103"},{"$f":"Tabelle!H27-2415018.5+Mondphasen!$B$2/24","v":"2026-06-30T01:58:58.624"},{"$f":"Tabelle!H28-2415018.5+Mondphasen!$B$2/24","v":"2026-07-07T21:31:41.070"}]
[{"$f":"Tabelle!H29-2415018.5+Mondphasen!$B$2/24","v":"2026-07-14T11:45:39.037"},{"$f":"Tabelle!H30-2415018.5+Mondphasen!$B$2/24","v":"2026-07-21T13:06:06.648"},{"$f":"Tabelle!H31-2415018.5+Mondphasen!$B$2/24","v":"2026-07-29T16:37:21.773"},{"$f":"Tabelle!H32-2415018.5+Mondphasen!$B$2/24","v":"2026-08-06T04:23:56.576"}]
[{"$f":"Tabelle!H33-2415018.5+Mondphasen!$B$2/24","v":"2026-08-12T19:39:22.069"},{"$f":"Tabelle!H34-2415018.5+Mondphasen!$B$2/24","v":"2026-08-20T04:46:49.143"},{"$f":"Tabelle!H35-2415018.5+Mondphasen!$B$2/24","v":"2026-08-28T06:19:22.356"},{"$f":"Tabelle!H36-2415018.5+Mondphasen!$B$2/24","v":"2026-09-04T09:52:38.359"}]
[{"$f":"Tabelle!H37-2415018.5+Mondphasen!$B$2/24","v":"2026-09-11T05:27:54.256"},{"$f":"Tabelle!H38-2415018.5+Mondphasen!$B$2/24","v":"2026-09-18T22:45:55.827"},{"$f":"Tabelle!H39-2415018.5+Mondphasen!$B$2/24","v":"2026-09-26T18:49:29.069"},{"$f":"Tabelle!H40-2415018.5+Mondphasen!$B$2/24","v":"2026-10-03T15:26:24.680"}]
[{"$f":"Tabelle!H41-2415018.5+Mondphasen!$B$2/24","v":"2026-10-10T17:48:51.753"},{"$f":"Tabelle!H42-2415018.5+Mondphasen!$B$2/24","v":"2026-10-18T18:15:28.528"},{"$f":"Tabelle!H43-2415018.5+Mondphasen!$B$2/24","v":"2026-10-26T06:12:17.808"},{"$f":"Tabelle!H44-2415018.5+Mondphasen!$B$2/24","v":"2026-11-01T22:30:48.137"}]
[{"$f":"Tabelle!H45-2415018.5+Mondphasen!$B$2/24","v":"2026-11-09T09:02:01.332"},{"$f":"Tabelle!H46-2415018.5+Mondphasen!$B$2/24","v":"2026-11-17T13:49:19.422"},{"$f":"Tabelle!H47-2415018.5+Mondphasen!$B$2/24","v":"2026-11-24T16:54:10.111"},{"$f":"Tabelle!H48-2415018.5+Mondphasen!$B$2/24","v":"2026-12-01T08:10:54.434"}]
[{"$f":"Tabelle!H49-2415018.5+Mondphasen!$B$2/24","v":"2026-12-09T02:54:32.560"},{"$f":"Tabelle!H50-2415018.5+Mondphasen!$B$2/24","v":"2026-12-17T07:44:05.121"},{"$f":"Tabelle!H51-2415018.5+Mondphasen!$B$2/24","v":"2026-12-24T03:28:52.827"},{"$f":"Tabelle!H52-2415018.5+Mondphasen!$B$2/24","v":"2026-12-30T21:00:08.699"}]
[{"$f":"Tabelle!H53-2415018.5+Mondphasen!$B$2/24","v":"2027-01-07T22:26:21.035"},{"$f":"Tabelle!H54-2415018.5+Mondphasen!$B$2/24","v":"2027-01-15T22:37:40.453"},{"$f":"Tabelle!H55-2415018.5+Mondphasen!$B$2/24","v":"2027-01-22T14:18:11.627"},{"$f":"Tabelle!H56-2415018.5+Mondphasen!$B$2/24","v":"2027-01-29T12:55:35.646"}]
[]
[]
[]
["Neumond"," erstes Viertel","Vollmond","letztes Viertel",null,null,"Vollmond",null,"erstes Viertel",null,"letztes Viertel",null,"Neumond"]
[{"$f":"TRUNC(A5)","v":"2025-12-20"},{"$f":"TRUNC(B5)","v":"2025-12-27"},"2026-01-03","2026-01-10",null,"O",{"$f":"C23","v":46025},"l",{"$f":"B23","v":46018},"☽",{"$f":"D23","v":46032},"☾",{"$f":"A23","v":46011},"l"]
[{"$f":"TRUNC(A6)","v":"2026-01-18"},"2026-01-26","2026-02-02","2026-02-09",null,null,46055,"l",{"$f":"B24","v":46048},"☽",{"$f":"D24","v":46062},"☾",{"$f":"A24","v":46040},"l"]
[{"$f":"TRUNC(A7)","v":"2026-02-17"},"2026-02-24","2026-03-03","2026-03-11",null,null,46084,"l",46077,"☽",46092,"☾",46070,"l"]
[{"$f":"TRUNC(A8)","v":"2026-03-19"},"2026-03-25","2026-04-02","2026-04-10",null,null,46114,"l",46106,"☽",46122,"☾",46100,"l"]
[{"$f":"TRUNC(A9)","v":"2026-04-17"},"2026-04-24","2026-05-01","2026-05-09",null,null,46143,"l",46136,"☽",46151,"☾",46129,"l"]
[{"$f":"TRUNC(A10)","v":"2026-05-16"},"2026-05-23","2026-05-31","2026-06-08",null,null,46173,"l",46165,"☽",46181,"☾",46158,"l"]
[{"$f":"TRUNC(A11)","v":"2026-06-15"},"2026-06-21","2026-06-30","2026-07-07",null,null,{"$f":"C29","v":46203},"l",46194,"☽",46210,"☾",46188,"l"]
[{"$f":"TRUNC(A12)","v":"2026-07-14"},"2026-07-21","2026-07-29","2026-08-06",null,null,46232,"l",46224,"☽",46240,"☾",46217,"l"]
[{"$f":"TRUNC(A13)","v":"2026-08-12"},"2026-08-20","2026-08-28","2026-09-04",null,null,46262,"l",46254,"☽",46269,"☾",46246,"l"]
[{"$f":"TRUNC(A14)","v":"2026-09-11"},"2026-09-18","2026-09-26","2026-10-03",null,null,46291,"l",46283,"☽",46298,"☾",46276,"l"]
[{"$f":"TRUNC(A15)","v":"2026-10-10"},"2026-10-18","2026-10-26","2026-11-01",null,null,46321,"l",46313,"☽",46327,"☾",46305,"l"]
[{"$f":"TRUNC(A16)","v":"2026-11-09"},"2026-11-17","2026-11-24","2026-12-01",null,null,46350,"l",{"$f":"B34","v":46343},"☽",46357,"☾",46335,"l"]
[{"$f":"TRUNC(A17)","v":"2026-12-09"},"2026-12-17","2026-12-24","2026-12-30",null,null,46380,"l",46373,"☽",46386,"☾",46365,"l"]
[{"$f":"TRUNC(A18)","v":"2027-01-07"},"2027-01-15","2027-01-22","2027-01-29",null,null,{"$f":"C36","v":46409},"l",46402,"☽",46416,"☾",46394,"l"]

{"sheet":"Tabelle","index":3,"n_rows":56,"n_cols":8,"rows_kept":56,"cut":false,"hidden":false,"merged":[]}
[{"$f":"Mondphasen!B1","v":2026},0,{"$f":"INT((A1-2000)*12.3685)+B1","v":321},{"$f":"2451550.09766+29.530588861*C1","v":2461029.4166843812},{"$f":"(2.5534+29.1053567*C1)*PI()/180","v":163.10752694386812},{"$f":"(201.5643+385.81693528*C1)*PI()/180","v":2165.0600023088264},{"$f":"(160.7108+390.67050284*C1)*PI()/180","v":2191.5391199620481},{"$f":"-0.4072*SIN(F1)+0.17241*SIN(E1)+0.01608*SIN(2*F1)+0.01039*SIN(2*G1)+0.00739*SIN(F1-E1)-0.00514*SIN(F1+E1)+0.00208*SIN(2*E1)-0.00111*SIN(F1-2*G1)+D1","v":2461029.5726300906}]
[{"$f":"A1","v":2026},0.25,321.25,2461036.7993315961,163.23452301996372,2166.7434462664737,2193.2437416032935,{"$f":"-0.62801*SIN(F2)+0.17172*SIN(E2)-0.01183*SIN(F2+E2)+0.00862*SIN(2*F2)+0.00804*SIN(2*G2)+0.00454*SIN(F2-E2)+0.00204*SIN(2*E2)-0.0018*SIN(F2-2*G2)+D2+0.00306","v":2461037.2993812971}]
[{"$f":"A2","v":2026},0.5,321.5,2461044.1819788115,163.36151909605931,2168.4268902241211,2194.9483632445381,{"$f":"-0.40614*SIN(F3)+0.17302*SIN(E3)+0.01614*SIN(2*F3)+0.01043*SIN(2*G3)+0.00734*SIN(F3-E3)-0.00515*SIN(F3+E3)+0.00209*SIN(2*E3)-0.00111*SIN(F3-2*G3)+D3","v":2461043.9193761051}]
[{"$f":"A3","v":2026},0.75,321.75,2461051.5646260269,163.48851517215488,2170.1103341817684,2196.6529848857831,{"$f":"-0.62801*SIN(F4)+0.17172*SIN(E4)-0.01183*SIN(F4+E4)+0.00862*SIN(2*F4)+0.00804*SIN(2*G4)+0.00454*SIN(F4-E4)+0.00204*SIN(2*E4)-0.0018*SIN(F4-2*G4)+D4-0.00306","v":2461051.1591473068}]
[{"$f":"A1+0.08","v":2026.08},0,322,2461058.9472732418,163.6155112482505,2171.7937781394157,2198.3576065270281,{"$f":"-0.4072*SIN(F5)+0.17241*SIN(E5)+0.01608*SIN(2*F5)+0.01039*SIN(2*G5)+0.00739*SIN(F5-E5)-0.00514*SIN(F5+E5)+0.00208*SIN(2*E5)-0.00111*SIN(F5-2*G5)+D5","v":2461059.3289160072}]
[{"$f":"A5","v":2026.08},0.25,322.25,2461066.3299204572,163.74250732434609,2173.4772220970631,2200.0622281682731,{"$f":"-0.62801*SIN(F6)+0.17172*SIN(E6)-0.01183*SIN(F6+E6)+0.00862*SIN(2*F6)+0.00804*SIN(2*G6)+0.00454*SIN(F6-E6)+0.00204*SIN(2*E6)-0.0018*SIN(F6-2*G6)+D6+0.00306","v":2461066.7013119524}]
[{"$f":"A6","v":2026.08},0.5,322.5,2461073.7125676726,163.86950340044169,2175.1606660547109,2201.7668498095181,{"$f":"-0.40614*SIN(F7)+0.17302*SIN(E7)+0.01614*SIN(2*F7)+0.01043*SIN(2*G7)+0.00734*SIN(F7-E7)-0.00515*SIN(F7+E7)+0.00209*SIN(2*E7)-0.00111*SIN(F7-2*G7)+D7","v":2461073.4242831636}]
[{"$f":"A7","v":2026.08},0.75,322.75,2461081.0952148875,163.99649947653728,2176.8441100123582,2203.4714714507631,{"$f":"-0.62801*SIN(F8)+0.17172*SIN(E8)-0.01183*SIN(F8+E8)+0.00862*SIN(2*F8)+0.00804*SIN(2*G8)+0.00454*SIN(F8-E8)+0.00204*SIN(2*E8)-0.0018*SIN(F8-2*G8)+D8-0.00306","v":2461081.0300866887}]
[{"$f":"A5+0.08","v":2026.1599999999999},0,323,2461088.4778621029,164.1234955526329,2178.5275539700056,2205.1760930920082,{"$f":"-0.4072*SIN(F9)+0.17241*SIN(E9)+0.01608*SIN(2*F9)+0.01039*SIN(2*G9)+0.00739*SIN(F9-E9)-0.00514*SIN(F9+E9)+0.00208*SIN(2*E9)-0.00111*SIN(F9-2*G9)+D9","v":2461089.0020432663}]
[{"$f":"A9","v":2026.1599999999999},0.25,323.25,2461095.8605093183,164.25049162872847,2180.2109979276534,2206.8807147332527,{"$f":"-0.62801*SIN(F10)+0.17172*SIN(E10)-0.01183*SIN(F10+E10)+0.00862*SIN(2*F10)+0.00804*SIN(2*G10)+0.00454*SIN(F10-E10)+0.00204*SIN(2*E10)-0.0018*SIN(F10-2*G10)+D10+0.00306","v":2461096.0211063675}]
[{"$f":"A10","v":2026.1599999999999},0.5,323.5,2461103.2431565337,164.37748770482409,2181.8944418853007,2208.5853363744977,{"$f":"-0.40614*SIN(F11)+0.17302*SIN(E11)+0.01614*SIN(2*F11)+0.01043*SIN(2*G11)+0.00734*SIN(F11-E11)-0.00515*SIN(F11+E11)+0.00209*SIN(2*E11)-0.00111*SIN(F11-2*G11)+D11","v":2461102.9862648724}]
[{"$f":"A11","v":2026.1599999999999},0.75,323.75,2461110.6258037486,164.50448378091966,2183.577885842948,2210.2899580157432,{"$f":"-0.62801*SIN(F12)+0.17172*SIN(E12)-0.01183*SIN(F12+E12)+0.00862*SIN(2*F12)+0.00804*SIN(2*G12)+0.00454*SIN(F12-E12)+0.00204*SIN(2*E12)-0.0018*SIN(F12-2*G12)+D12-0.00306","v":2461110.9028860005}]
[{"$f":"A9+0.08","v":2026.2399999999998},0,324,2461118.008450964,164.63147985701531,2185.2613298005954,2211.9945796569878,{"$f":"-0.4072*SIN(F13)+0.17241*SIN(E13)+0.01608*SIN(2*F13)+0.01039*SIN(2*G13)+0.00739*SIN(F13-E13)-0.00514*SIN(F13+E13)+0.00208*SIN(2*E13)-0.00111*SIN(F13-2*G13)+D13","v":2461118.5596707831}]
[{"$f":"A13","v":2026.2399999999998},0.25,324.25,2461125.3910981794,164.75847593311087,2186.9447737582427,2213.6992012982328,{"$f":"-0.62801*SIN(F14)+0.17172*SIN(E14)-0.01183*SIN(F14+E14)+0.00862*SIN(2*F14)+0.00804*SIN(2*G14)+0.00454*SIN(F14-E14)+0.00204*SIN(2*E14)-0.0018*SIN(F14-2*G14)+D14+0.00306","v":2461125.3051908747}]
[{"$f":"A14","v":2026.2399999999998},0.5,324.5,2461132.7737453943,164.88547200920647,2188.6282177158905,2215.4038229394778,{"$f":"-0.40614*SIN(F15)+0.17302*SIN(E15)+0.01614*SIN(2*F15)+0.01043*SIN(2*G15)+0.00734*SIN(F15-E15)-0.00515*SIN(F15+E15)+0.00209*SIN(2*E15)-0.00111*SIN(F15-2*G15)+D15","v":2461132.5932230507}]
[{"$f":"A15","v":2026.2399999999998},0.75,324.75,2461140.1563926097,165.01246808530209,2190.3116616735379,2217.1084445807228,{"$f":"-0.62801*SIN(F16)+0.17172*SIN(E16)-0.01183*SIN(F16+E16)+0.00862*SIN(2*F16)+0.00804*SIN(2*G16)+0.00454*SIN(F16-E16)+0.00204*SIN(2*E16)-0.0018*SIN(F16-2*G16)+D16-0.00306","v":2461140.7043378414}]
[{"$f":"A13+0.08","v":2026.3199999999997},0,325,2461147.5390398251,165.13946416139768,2191.9951056311857,2218.8130662219678,{"$f":"-0.4072*SIN(F17)+0.17241*SIN(E17)+0.01608*SIN(2*F17)+0.01039*SIN(2*G17)+0.00739*SIN(F17-E17)-0.00514*SIN(F17+E17)+0.00208*SIN(2*E17)-0.00111*SIN(F17-2*G17)+D17","v":2461147.9963294682}]
[{"$f":"A17","v":2026.3199999999997},0.25,325.25,2461154.92168704,165.26646023749328,2193.678549588833,2220.5176878632128,{"$f":"-0.62801*SIN(F18)+0.17172*SIN(E18)-0.01183*SIN(F18+E18)+0.00862*SIN(2*F18)+0.00804*SIN(2*G18)+0.00454*SIN(F18-E18)+0.00204*SIN(2*E18)-0.0018*SIN(F18-2*G18)+D18+0.00306","v":2461154.606317543}]
[{"$f":"A18","v":2026.3199999999997},0.5,325.5,2461162.3043342554,165.39345631358884,2195.3619935464803,2222.2223095044578,{"$f":"-0.40614*SIN(F19)+0.17302*SIN(E19)+0.01614*SIN(2*F19)+0.01043*SIN(2*G19)+0.00734*SIN(F19-E19)-0.00515*SIN(F19+E19)+0.00209*SIN(2*E19)-0.00111*SIN(F19-2*G19)+D19","v":2461162.2259708885}]
[{"$f":"A19","v":2026.3199999999997},0.75,325.75,2461169.6869814708,165.52045238968446,2197.0454375041277,2223.9269311457024,{"$f":"-0.62801*SIN(F20)+0.17172*SIN(E20)-0.01183*SIN(F20+E20)+0.00862*SIN(2*F20)+0.00804*SIN(2*G20)+0.00454*SIN(F20-E20)+0.00204*SIN(2*E20)-0.0018*SIN(F20-2*G20)+D20-0.00306","v":2461170.3837609892}]
[{"$f":"A17+0.08","v":2026.3999999999996},0,326,2461177.0696286862,165.64744846578006,2198.728881461775,2225.6315527869474,{"$f":"-0.4072*SIN(F21)+0.17241*SIN(E21)+0.01608*SIN(2*F21)+0.01039*SIN(2*G21)+0.00739*SIN(F21-E21)-0.00514*SIN(F21+E21)+0.00208*SIN(2*E21)-0.00111*SIN(F21-2*G21)+D21","v":2461177.3355265353}]
[{"$f":"A21","v":2026.3999999999996},0.25,326.25,2461184.4522759011,165.77444454187565,2200.4123254194228,2227.3361744281929,{"$f":"-0.62801*SIN(F22)+0.17172*SIN(E22)-0.01183*SIN(F22+E22)+0.00862*SIN(2*F22)+0.00804*SIN(2*G22)+0.00454*SIN(F22-E22)+0.00204*SIN(2*E22)-0.0018*SIN(F22-2*G22)+D22+0.00306","v":2461183.9672613735}]
[{"$f":"A22","v":2026.3999999999996},0.5,326.5,2461191.8349231165,165.90144061797125,2202.0957693770702,2229.0407960694374,{"$f":"-0.40614*SIN(F23)+0.17302*SIN(E23)+0.01614*SIN(2*F23)+0.01043*SIN(2*G23)+0.00734*SIN(F23-E23)-0.00515*SIN(F23+E23)+0.00209*SIN(2*E23)-0.00111*SIN(F23-2*G23)+D23","v":2461191.8663888075}]
[{"$f":"A23","v":2026.3999999999996},0.75,326.75,2461199.2175703319,166.02843669406687,2203.7792133347175,2230.7454177106824,{"$f":"-0.62801*SIN(F24)+0.17172*SIN(E24)-0.01183*SIN(F24+E24)+0.00862*SIN(2*F24)+0.00804*SIN(2*G24)+0.00454*SIN(F24-E24)+0.00204*SIN(2*E24)-0.0018*SIN(F24-2*G24)+D24-0.00306","v":2461199.9184770412}]
[{"$f":"A21+0.08","v":2026.4799999999996},0,327,2461206.6002175468,166.15543277016246,2205.4626572923653,2232.4500393519274,{"$f":"-0.4072*SIN(F25)+0.17241*SIN(E25)+0.01608*SIN(2*F25)+0.01039*SIN(2*G25)+0.00739*SIN(F25-E25)-0.00514*SIN(F25+E25)+0.00208*SIN(2*E25)-0.00111*SIN(F25-2*G25)+D25","v":2461206.6218768088}]
[{"$f":"A25","v":2026.4799999999996},0.25,327.25,2461213.9828647622,166.28242884625806,2207.1461012500126,2234.1546609931725,{"$f":"-0.62801*SIN(F26)+0.17172*SIN(E26)-0.01183*SIN(F26+E26)+0.00862*SIN(2*F26)+0.00804*SIN(2*G26)+0.00454*SIN(F26-E26)+0.00204*SIN(2*E26)-0.0018*SIN(F26-2*G26)+D26+0.00306","v":2461213.4146655495}]
[{"$f":"A26","v":2026.4799999999996},0.5,327.5,2461221.3655119776,166.40942492235365,2208.8295452076604,2235.8592826344175,{"$f":"-0.40614*SIN(F27)+0.17302*SIN(E27)+0.01614*SIN(2*F27)+0.01043*SIN(2*G27)+0.00734*SIN(F27-E27)-0.00515*SIN(F27+E27)+0.00209*SIN(2*E27)-0.00111*SIN(F27-2*G27)+D27","v":2461221.4992896314}]
[{"$f":"A27","v":2026.4799999999996},0.75,327.75,2461228.7481591925,166.53642099844927,2210.5129891653078,2237.5639042756625,{"$f":"-0.62801*SIN(F28)+0.17172*SIN(E28)-0.01183*SIN(F28+E28)+0.00862*SIN(2*F28)+0.00804*SIN(2*G28)+0.00454*SIN(F28-E28)+0.00204*SIN(2*E28)-0.0018*SIN(F28-2*G28)+D28-0.00306","v":2461229.3136697863}]
[{"$f":"A25+0.08","v":2026.5599999999995},0,328,2461236.1308064079,166.66341707454484,2212.1964331229551,2239.2685259169075,{"$f":"-0.4072*SIN(F29)+0.17241*SIN(E29)+0.01608*SIN(2*F29)+0.01039*SIN(2*G29)+0.00739*SIN(F29-E29)-0.00514*SIN(F29+E29)+0.00208*SIN(2*E29)-0.00111*SIN(F29-2*G29)+D29","v":2461235.9067018144}]
[{"$f":"A29","v":2026.5599999999995},0.25,328.25,2461243.5134536233,166.79041315064043,2213.8798770806025,2240.973147558152,{"$f":"-0.62801*SIN(F30)+0.17172*SIN(E30)-0.01183*SIN(F30+E30)+0.00862*SIN(2*F30)+0.00804*SIN(2*G30)+0.00454*SIN(F30-E30)+0.00204*SIN(2*E30)-0.0018*SIN(F30-2*G30)+D30+0.00306","v":2461242.9625769448}]
[{"$f":"A30","v":2026.5599999999995},0.5,328.5,2461250.8961008387,166.91740922673603,2215.5633210382498,2242.6777691993971,{"$f":"-0.40614*SIN(F31)+0.17302*SIN(E31)+0.01614*SIN(2*F31)+0.01043*SIN(2*G31)+0.00734*SIN(F31-E31)-0.00515*SIN(F31+E31)+0.00209*SIN(2*E31)-0.00111*SIN(F31-2*G31)+D31","v":2461251.1092797834}]
[{"$f":"A31","v":2026.5599999999995},0.75,328.75,2461258.2787480536,167.04440530283165,2217.2467649958976,2244.3823908406421,{"$f":"-0.62801*SIN(F32)+0.17172*SIN(E32)-0.01183*SIN(F32+E32)+0.00862*SIN(2*F32)+0.00804*SIN(2*G32)+0.00454*SIN(F32-E32)+0.00204*SIN(2*E32)-0.0018*SIN(F32-2*G32)+D32-0.00306","v":2461258.5999603695}]
[{"$f":"A29+0.08","v":2026.6399999999994},0,329,2461265.661395269,167.17140137892724,2218.9302089535449,2246.0870124818871,{"$f":"-0.4072*SIN(F33)+0.17241*SIN(E33)+0.01608*SIN(2*F33)+0.01039*SIN(2*G33)+0.00739*SIN(F33-E33)-0.00514*SIN(F33+E33)+0.00208*SIN(2*E33)-0.00111*SIN(F33-2*G33)+D33","v":2461265.2356720981}]
[{"$f":"A33","v":2026.6399999999994},0.25,329.25,2461273.0440424844,167.29839745502281,2220.6136529111923,2247.7916341231321,{"$f":"-0.62801*SIN(F34)+0.17172*SIN(E34)-0.01183*SIN(F34+E34)+0.00862*SIN(2*F34)+0.00804*SIN(2*G34)+0.00454*SIN(F34-E34)+0.00204*SIN(2*E34)-0.0018*SIN(F34-2*G34)+D34+0.00306","v":2461272.6158465645}]
[{"$f":"A34","v":2026.6399999999994},0.5,329.5,2461280.4266896993,167.42539353111846,2222.2970968688396,2249.4962557643771,{"$f":"-0.40614*SIN(F35)+0.17302*SIN(E35)+0.01614*SIN(2*F35)+0.01043*SIN(2*G35)+0.00734*SIN(F35-E35)-0.00515*SIN(F35+E35)+0.00209*SIN(2*E35)-0.00111*SIN(F35-2*G35)+D35","v":2461280.6801198642}]
[{"$f":"A35","v":2026.6399999999994},0.75,329.75,2461287.8093369147,167.55238960721402,2223.9805408264874,2251.2008774056221,{"$f":"-0.62801*SIN(F36)+0.17172*SIN(E36)-0.01183*SIN(F36+E36)+0.00862*SIN(2*F36)+0.00804*SIN(2*G36)+0.00454*SIN(F36-E36)+0.00204*SIN(2*E36)-0.0018*SIN(F36-2*G36)+D36-0.00306","v":2461287.828221743}]
[{"$f":"A33+0.08","v":2026.7199999999993},0,330,2461295.1919841301,167.67938568330965,2225.6639847841352,2252.9054990468671,{"$f":"-0.4072*SIN(F37)+0.17241*SIN(E37)+0.01608*SIN(2*F37)+0.01039*SIN(2*G37)+0.00739*SIN(F37-E37)-0.00514*SIN(F37+E37)+0.00208*SIN(2*E37)-0.00111*SIN(F37-2*G37)+D37","v":2461294.6443779627}]
[{"$f":"A37","v":2026.7199999999993},0.25,330.25,2461302.574631345,167.80638175940521,2227.3474287417826,2254.6101206881121,{"$f":"-0.62801*SIN(F38)+0.17172*SIN(E38)-0.01183*SIN(F38+E38)+0.00862*SIN(2*F38)+0.00804*SIN(2*G38)+0.00454*SIN(F38-E38)+0.00204*SIN(2*E38)-0.0018*SIN(F38-2*G38)+D38+0.00306","v":2461302.3652294739}]
[{"$f":"A38","v":2026.7199999999993},0.5,330.5,2461309.9572785604,167.93337783550083,2229.0308726994299,2256.3147423293572,{"$f":"-0.40614*SIN(F39)+0.17302*SIN(E39)+0.01614*SIN(2*F39)+0.01043*SIN(2*G39)+0.00734*SIN(F39-E39)-0.00515*SIN(F39+E39)+0.00209*SIN(2*E39)-0.00111*SIN(F39-2*G39)+D39","v":2461310.2010308942}]
[{"$f":"A39","v":2026.7199999999993},0.75,330.75,2461317.3399257758,168.06037391159643,2230.7143166570772,2258.0193639706017,{"$f":"-0.62801*SIN(F40)+0.17172*SIN(E40)-0.01183*SIN(F40+E40)+0.00862*SIN(2*F40)+0.00804*SIN(2*G40)+0.00454*SIN(F40-E40)+0.00204*SIN(2*E40)-0.0018*SIN(F40-2*G40)+D40-0.00306","v":2461317.0600078735}]
[{"$f":"A37+0.08","v":2026.7999999999993},0,331,2461324.7225729912,168.18736998769202,2232.3977606147246,2259.7239856118467,{"$f":"-0.4072*SIN(F41)+0.17241*SIN(E41)+0.01608*SIN(2*F41)+0.01039*SIN(2*G41)+0.00739*SIN(F41-E41)-0.00514*SIN(F41+E41)+0.00208*SIN(2*E41)-0.00111*SIN(F41-2*G41)+D41","v":2461324.1589323306}]
[{"$f":"A41","v":2026.7999999999993},0.25,331.25,2461332.1052202061,168.31436606378762,2234.0812045723719,2261.4286072530917,{"$f":"-0.62801*SIN(F42)+0.17172*SIN(E42)-0.01183*SIN(F42+E42)+0.00862*SIN(2*F42)+0.00804*SIN(2*G42)+0.00454*SIN(F42-E42)+0.00204*SIN(2*E42)-0.0018*SIN(F42-2*G42)+D42+0.00306","v":2461332.1774135134}]
[{"$f":"A42","v":2026.7999999999993},0.5,331.5,2461339.4878674215,168.44136213988324,2235.7646485300197,2263.1332288943368,{"$f":"-0.40614*SIN(F43)+0.17302*SIN(E43)+0.01614*SIN(2*F43)+0.01043*SIN(2*G43)+0.00734*SIN(F43-E43)-0.00515*SIN(F43+E43)+0.00209*SIN(2*E43)-0.00111*SIN(F43-2*G43)+D43","v":2461339.6752061117}]
[{"$f":"A43","v":2026.7999999999993},0.75,331.75,2461346.8705146369,168.5683582159788,2237.4480924876671,2264.8378505355818,{"$f":"-0.62801*SIN(F44)+0.17172*SIN(E44)-0.01183*SIN(F44+E44)+0.00862*SIN(2*F44)+0.00804*SIN(2*G44)+0.00454*SIN(F44-E44)+0.00204*SIN(2*E44)-0.0018*SIN(F44-2*G44)+D44-0.00306","v":2461346.3547238074}]
[{"$f":"A41+0.08","v":2026.8799999999992},0,332,2461354.2531618518,168.6953542920744,2239.1315364453144,2266.5424721768268,{"$f":"-0.4072*SIN(F45)+0.17241*SIN(E45)+0.01608*SIN(2*F45)+0.01039*SIN(2*G45)+0.00739*SIN(F45-E45)-0.00514*SIN(F45+E45)+0.00208*SIN(2*E45)-0.00111*SIN(F45-2*G45)+D45","v":2461353.7930709678}]
[{"$f":"A45","v":2026.8799999999992},0.25,332.25,2461361.6358090672,168.82235036816999,2240.8149804029622,2268.2470938180718,{"$f":"-0.62801*SIN(F46)+0.17172*SIN(E46)-0.01183*SIN(F46+E46)+0.00862*SIN(2*F46)+0.00804*SIN(2*G46)+0.00454*SIN(F46-E46)+0.00204*SIN(2*E46)-0.0018*SIN(F46-2*G46)+D46+0.00306","v":2461361.9925859058}]
[{"$f":"A46","v":2026.8799999999992},0.5,332.5,2461369.0184562826,168.94934644426561,2242.4984243606095,2269.9517154593168,{"$f":"-0.40614*SIN(F47)+0.17302*SIN(E47)+0.01614*SIN(2*F47)+0.01043*SIN(2*G47)+0.00734*SIN(F47-E47)-0.00515*SIN(F47+E47)+0.00209*SIN(2*E47)-0.00111*SIN(F47-2*G47)+D47","v":2461369.1209503547}]
[{"$f":"A47","v":2026.8799999999992},0.75,332.75,2461376.4011034979,169.07634252036121,2244.1818683182573,2271.6563371005618,{"$f":"-0.62801*SIN(F48)+0.17172*SIN(E48)-0.01183*SIN(F48+E48)+0.00862*SIN(2*F48)+0.00804*SIN(2*G48)+0.00454*SIN(F48-E48)+0.00204*SIN(2*E48)-0.0018*SIN(F48-2*G48)+D48-0.00306","v":2461375.7575744689}]
[{"$f":"A45+0.08","v":2026.9599999999991},0,333,2461383.7837507129,169.20333859645677,2245.8653122759047,2273.3609587418068,{"$f":"-0.4072*SIN(F49)+0.17241*SIN(E49)+0.01608*SIN(2*F49)+0.01039*SIN(2*G49)+0.00739*SIN(F49-E49)-0.00514*SIN(F49+E49)+0.00208*SIN(2*E49)-0.00111*SIN(F49-2*G49)+D49","v":2461383.5378768519}]
[{"$f":"A49","v":2026.9599999999991},0.25,333.25,2461391.1663979283,169.3303346725524,2247.548756233552,2275.0655803830514,{"$f":"-0.62801*SIN(F50)+0.17172*SIN(E50)-0.01183*SIN(F50+E50)+0.00862*SIN(2*F50)+0.00804*SIN(2*G50)+0.00454*SIN(F50-E50)+0.00204*SIN(2*E50)-0.0018*SIN(F50-2*G50)+D50+0.00306","v":2461391.7389481566}]
[{"$f":"A50","v":2026.9599999999991},0.5,333.5,2461398.5490451436,169.45733074864799,2249.2322001911994,2276.7702020242964,{"$f":"-0.40614*SIN(F51)+0.17302*SIN(E51)+0.01614*SIN(2*F51)+0.01043*SIN(2*G51)+0.00734*SIN(F51-E51)-0.00515*SIN(F51+E51)+0.00209*SIN(2*E51)-0.00111*SIN(F51-2*G51)+D51","v":2461398.5617225301}]
[{"$f":"A51","v":2026.9599999999991},0.75,333.75,2461405.9316923586,169.58432682474361,2250.9156441488467,2278.4748236655414,{"$f":"-0.62801*SIN(F52)+0.17172*SIN(E52)-0.01183*SIN(F52+E52)+0.00862*SIN(2*F52)+0.00804*SIN(2*G52)+0.00454*SIN(F52-E52)+0.00204*SIN(2*E52)-0.0018*SIN(F52-2*G52)+D52-0.00306","v":2461405.2917673462}]
[{"$f":"A49+0.08","v":2027.0399999999991},0,334,2461413.314339574,169.71132290083918,2252.599088106494,2280.1794453067864,{"$f":"-0.4072*SIN(F53)+0.17241*SIN(E53)+0.01608*SIN(2*F53)+0.01039*SIN(2*G53)+0.00739*SIN(F53-E53)-0.00514*SIN(F53+E53)+0.00208*SIN(2*E53)-0.00111*SIN(F53-2*G53)+D53","v":2461413.3516323455}]
[{"$f":"A53","v":2027.0399999999991},0.25,334.25,2461420.6969867893,169.83831897693483,2254.2825320641418,2281.8840669480314,{"$f":"-0.62801*SIN(F54)+0.17172*SIN(E54)-0.01183*SIN(F54+E54)+0.00862*SIN(2*F54)+0.00804*SIN(2*G54)+0.00454*SIN(F54-E54)+0.00204*SIN(2*E54)-0.0018*SIN(F54-2*G54)+D54+0.00306","v":2461421.3594959872}]
[{"$f":"A54","v":2027.0399999999991},0.5,334.5,2461428.0796340043,169.96531505303039,2255.9659760217892,2283.5886885892764,{"$f":"-0.40614*SIN(F55)+0.17302*SIN(E55)+0.01614*SIN(2*F55)+0.01043*SIN(2*G55)+0.00734*SIN(F55-E55)-0.00515*SIN(F55+E55)+0.00209*SIN(2*E55)-0.00111*SIN(F55-2*G55)+D55","v":2461428.0126345768}]
[{"$f":"A55","v":2027.0399999999991},0.75,334.75,2461435.4622812197,170.09231112912599,2257.6494199794365,2285.2933102305215,{"$f":"-0.62801*SIN(F56)+0.17172*SIN(E56)-0.01183*SIN(F56+E56)+0.00862*SIN(2*F56)+0.00804*SIN(2*G56)+0.00454*SIN(F56-E56)+0.00204*SIN(2*E56)-0.0018*SIN(F56-2*G56)+D56-0.00306","v":2461434.9552736804}]