{"text_format":"1","workbook":"xlsx","n_sheets":4,"sheets":["Kalender","Feiertage","Mondphasen","Tabelle"],"not_rendered":{"charts":0,"images":2,"macros":1,"external_links":0,"defined_names":7,"comments":0,"pivot_tables":0},"unopened":[],"bounds":{"document_bytes":16777216,"sheet_cells":100000,"rows_first":2000,"rows_last":500,"rows_between":2000,"halvings":0,"cell_chars":16384,"cell_head_chars":4096},"cells_cut":0,"cells_raw":0,"read":"whole","date_system":"1900"}

{"sheet":"Kalender","index":0,"n_rows":34,"n_cols":72,"rows_kept":34,"cut":false,"hidden":false,"merged":[[0,0,0,9],[0,11,0,18],[2,36,2,41],[2,42,2,47],[2,48,2,53],[0,21,0,30],[2,54,2,59],[2,60,2,65],[2,66,2,71],[2,0,2,5],[2,6,2,11],[2,12,2,17],[2,18,2,23],[2,24,2,29],[2,30,2,35]]}
["Kalender",null,null,null,null,null,null,null,null,null,null,2026]
[null,null,{"$f":"NETWORKDAYS(A4,EOMONTH(A4,0),GFT)","v":20},"Arbeitstage",null,null,null,null,{"$f":"NETWORKDAYS(G4,EOMONTH(G4,0),GFT)","v":20},"Arbeitstage",null,null,null,null,{"$f":"NETWORKDAYS(M4,EOMONTH(M4,0),GFT)","v":22},"Arbeitstage",null,null,null,null,{"$f":"NETWORKDAYS(S4,EOMONTH(S4,0),GFT)","v":20},"Arbeitstage",null,null,null,null,{"$f":"NETWORKDAYS(Y4,EOMONTH(Y4,0),GFT)","v":19},"Arbeitstage",null,null,null,null,{"$f":"NETWORKDAYS(AE4,EOMONTH(AE4,0),GFT)","v":22},"Arbeitstage",null,null,null,null,{"$f":"NETWORKDAYS(AK4,EOMONTH(AK4,0),GFT)","v":23},"Arbeitstage",null,null,null,null,{"$f":"NETWORKDAYS(AQ4,EOMONTH(AQ4,0),GFT)","v":21},"Arbeitstage",null,null,null,null,{"$f":"NETWORKDAYS(AW4,EOMONTH(AW4,0),GFT)","v":22},"Arbeitstage",null,null,null,null,{"$f":"NETWORKDAYS(BC4,EOMONTH(BC4,0),GFT)","v":22},"Arbeitstage",null,null,null,null,{"$f":"NETWORKDAYS(BI4,EOMONTH(BI4,0),GFT)","v":21},"Arbeitstage",null,null,null,null,{"$f":"NETWORKDAYS(BO4,EOMONTH(BO4,0),GFT)","v":22},"Arbeitstage"]
["Januar",null,null,null,null,null,"Februar",null,null,null,null,null,"März",null,null,null,null,null,"April",null,null,null,null,null,"Mai",null,null,null,null,null,"Juni",null,null,null,null,null,"Juli",null,null,null,null,null,"August",null,null,null,null,null,"September",null,null,null,null,null,"Oktober",null,null,null,null,null,"November",null,null,null,null,null,"Dezember"]
[{"$f":"IFERROR((ROW()-3&\".\"&A$3&\".\"&$L$1)*1,\"\")","v":"2026-01-01"},{"$f":"IFERROR((ROW()-3&\".\"&A$3&\".\"&$L$1)*1,\"\")","v":46023},{"$f":"A4","v":"2026-01-01"},{"$f":"IFERROR(VLOOKUP(B4,Feiertage!$A$3:$B$29,2,FALSE),\"\")","v":"Neujahr"},{"$f":"IFERROR(VLOOKUP(B4,Mondphasen!$G$23:$H$36,2,FALSE),\"\")","v":""},{"$f":"IFERROR(WEEKNUM(A4,21),\"\")","v":1},{"$f":"IFERROR((ROW()-3&\".\"&G$3&\".\"&$L$1)*1,\"\")","v":"2026-02-01"},{"$f":"IFERROR((ROW()-3&\".\"&G$3&\".\"&$L$1)*1,\"\")","v":46054},{"$f":"G4","v":"2026-02-01"},{"$f":"IFERROR(VLOOKUP(H4,Feiertage!$A$3:$B$29,2,FALSE),\"\")","v":""},{"$f":"IFERROR(VLOOKUP(H4,Mondphasen!$G$23:$H$36,2,FALSE),\"\")","v":""},{"$f":"IFERROR(WEEKNUM(G4,21),\"\")","v":5},{"$f":"IFERROR((ROW()-3&\".\"&M$3&\".\"&$L$1)*1,\"\")","v":"2026-03-01"},{"$f":"IFERROR((ROW()-3&\".\"&M$3&\".\"&$L$1)*1,\"\")","v":46082},{"$f":"M4","v":"2026-03-01"},{"$f":"IFERROR(VLOOKUP(N4,Feiertage!$A$3:$B$29,2,FALSE),\"\")","v":""},{"$f":"IFERROR(VLOOKUP(N4,Mondphasen!$G$23:$H$36,2,FALSE),\"\")","v":""},{"$f":"IFERROR(WEEKNUM(M4,21),\"\")","v":9},{"$f":"IFERROR((ROW()-3&\".\"&S$3&\".\"&$L$1)*1,\"\")","v":"2026-04-01"},{"$f":"IFERROR((ROW()-3&\".\"&S$3&\".\"&$L$1)*1,\"\")","v":46113},{"$f":"S4","v":"2026-04-01"},{"$f":"IFERROR(VLOOKUP(T4,Feiertage!$A$3:$B$29,2,FALSE),\"\")","v":""},{"$f":"IFERROR(VLOOKUP(T4,Mondphasen!$G$23:$H$36,2,FALSE),\"\")","v":""},{"$f":"IFERROR(WEEKNUM(S4,21),\"\")","v":14},{"$f":"IFERROR((ROW()-3&\".\"&Y$3&\".\"&$L$1)*1,\"\")","v":"2026-05-01"},{"$f":"IFERROR((ROW()-3&\".\"&Y$3&\".\"&$L$1)*1,\"\")","v":46143},{"$f":"Y4","v":"2026-05-01"},{"$f":"IFERROR(VLOOKUP(Z4,Feiertage!$A$3:$B$29,2,FALSE),\"\")","v":"Tag der Arbeit"},{"$f":"IFERROR(VLOOKUP(Z4,Mondphasen!$G$23:$H$36,2,FALSE),\"\")","v":"l"},{"$f":"IFERROR(WEEKNUM(Y4,21),\"\")","v":18},{"$f":"IFERROR((ROW()-3&\".\"&AE$3&\".\"&$L$1)*1,\"\")","v":"2026-06-01"},{"$f":"IFERROR((ROW()-3&\".\"&AE$3&\".\"&$L$1)*1,\"\")","v":46174},{"$f":"AE4","v":"2026-06-01"},{"$f":"IFERROR(VLOOKUP(AF4,Feiertage!$A$3:$B$29,2,FALSE),\"\")","v":""},{"$f":"IFERROR(VLOOKUP(AF4,Mondphasen!$G$23:$H$36,2,FALSE),\"\")","v":""},{"$f":"IFERROR(WEEKNUM(AE4,21),\"\")","v":23},{"$f":"IFERROR((ROW()-3&\".\"&AK$3&\".\"&$L$1)*1,\"\")","v":"2026-07-01"},{"$f":"IFERROR((ROW()-3&\".\"&AK$3&\".\"&$L$1)*1,\"\")","v":46204},{"$f":"AK4","v":"2026-07-01"},{"$f":"IFERROR(VLOOKUP(AL4,Feiertage!$A$3:$B$29,2,FALSE),\"\")","v":""},{"$f":"IFERROR(VLOOKUP(AL4,Mondphasen!$G$23:$H$36,2,FALSE),\"\")","v":""},{"$f":"IFERROR(WEEKNUM(AK4,21),\"\")","v":27},{"$f":"IFERROR((ROW()-3&\".\"&AQ$3&\".\"&$L$1)*1,\"\")","v":"2026-08-01"},{"$f":"IFERROR((ROW()-3&\".\"&AQ$3&\".\"&$L$1)*1,\"\")","v":46235},{"$f":"AQ4","v":"2026-08-01"},{"$f":"IFERROR(VLOOKUP(AR4,Feiertage!$A$3:$B$29,2,FALSE),\"\")","v":"National-Feiertag CH"},{"$f":"IFERROR(VLOOKUP(AR4,Mondphasen!$G$23:$H$36,2,FALSE),\"\")","v":""},{"$f":"IFERROR(WEEKNUM(AQ4,21),\"\")","v":31},{"$f":"IFERROR((ROW()-3&\".\"&AW$3&\".\"&$L$1)*1,\"\")","v":"2026-09-01"},{"$f":"IFERROR((ROW()-3&\".\"&AW$3&\".\"&$L$1)*1,\"\")","v":46266},{"$f":"AW4","v":"2026-09-01"},{"$f":"IFERROR(VLOOKUP(AX4,Feiertage!$A$3:$B$29,2,FALSE),\"\")","v":""},{"$f":"IFERROR(VLOOKUP(AX4,Mondphasen!$G$23:$H$36,2,FALSE),\"\")","v":""},{"$f":"IFERROR(WEEKNUM(AW4,21),\"\")","v":36},{"$f":"IFERROR((ROW()-3&\".\"&BC$3&\".\"&$L$1)*1,\"\")","v":"2026-10-01"},{"$f":"IFERROR((ROW()-3&\".\"&BC$3&\".\"&$L$1)*1,\"\")","v":46296},{"$f":"BC4","v":"2026-10-01"},{"$f":"IFERROR(VLOOKUP(BD4,Feiertage!$A$3:$B$29,2,FALSE),\"\")","v":""},{"$f":"IFERROR(VLOOKUP(BD4,Mondphasen!$G$23:$H$36,2,FALSE),\"\")","v":""},{"$f":"IFERROR(WEEKNUM(BC4,21),\"\")","v":40},{"$f":"IFERROR((ROW()-3&\".\"&BI$3&\".\"&$L$1)*1,\"\")","v":"2026-11-01"},{"$f":"IFERROR((ROW()-3&\".\"&BI$3&\".\"&$L$1)*1,\"\")","v":46327},{"$f":"BI4","v":"2026-11-01"},{"$f":"IFERROR(VLOOKUP(BJ4,Feiertage!$A$3:$B$29,2,FALSE),\"\")","v":"Allerheiligen"},{"$f":"IFERROR(VLOOKUP(BJ4,Mondphasen!$G$23:$H$36,2,FALSE),\"\")","v":""},{"$f":"IFERROR(WEEKNUM(BI4,21),\"\")","v":44},{"$f":"IFERROR((ROW()-3&\".\"&BO$3&\".\"&$L$1)*1,\"\")","v":"2026-12-01"},{"$f":"IFERROR((ROW()-3&\".\"&BO$3&\".\"&$L$1)*1,\"\")","v":46357},{"$f":"BO4","v":"2026-12-01"},{"$f":"IFERROR(VLOOKUP(BP4,Feiertage!$A$3:$B$29,2,FALSE),\"\")","v":""},{"$f":"IFERROR(VLOOKUP(BP4,Mondphasen!$G$23:$H$36,2,FALSE),\"\")","v":""},{"$f":"IFERROR(WEEKNUM(BO4,21),\"\")","v":49}]
["2026-01-02",46024,{"$f":"A5","v":"2026-01-02"},{"$f":"IFERROR(VLOOKUP(B5,Feiertage!$A$3:$B$29,2,FALSE),\"\")","v":"Berchtoldstag"},{"$f":"IFERROR(VLOOKUP(B5,Mondphasen!$G$23:$H$36,2,FALSE),\"\")","v":""},{"$f":"IFERROR(WEEKNUM(A5,21),\"\")","v":1},"2026-02-02",46055,{"$f":"G5","v":"2026-02-02"},{"$f":"IFERROR(VLOOKUP(H5,Feiertage!$A$3:$B$29,2,FALSE),\"\")","v":""},{"$f":"IFERROR(VLOOKUP(H5,Mondphasen!$G$23:$H$36,2,FALSE),\"\")","v":"l"},6,"2026-03-02",46083,{"$f":"M5","v":"2026-03-02"},{"$f":"IFERROR(VLOOKUP(N5,Feiertage!$A$3:$B$29,2,FALSE),\"\")","v":""},{"$f":"IFERROR(VLOOKUP(N5,Mondphasen!$G$23:$H$36,2,FALSE),\"\")","v":""},{"$f":"IFERROR(WEEKNUM(M5,21),\"\")","v":10},"2026-04-02",46114,{"$f":"S5","v":"2026-04-02"},{"$f":"IFERROR(VLOOKUP(T5,Feiertage!$A$3:$B$29,2,FALSE),\"\")","v":"Grün-Donnerstag"},{"$f":"IFERROR(VLOOKUP(T5,Mondphasen!$G$23:$H$36,2,FALSE),\"\")","v":"l"},14,"2026-05-02",46144,{"$f":"Y5","v":"2026-05-02"},{"$f":"IFERROR(VLOOKUP(Z5,Feiertage!$A$3:$B$29,2,FALSE),\"\")","v":""},{"$f":"IFERROR(VLOOKUP(Z5,Mondphasen!$G$23:$H$36,2,FALSE),\"\")","v":""},18,"2026-06-02",46175,{"$f":"AE5","v":"2026-06-02"},{"$f":"IFERROR(VLOOKUP(AF5,Feiertage!$A$3:$B$29,2,FALSE),\"\")","v":""},{"$f":"IFERROR(VLOOKUP(AF5,Mondphasen!$G$23:$H$36,2,FALSE),\"\")","v":""},23,"2026-07-02",46205,{"$f":"AK5","v":"2026-07-02"},{"$f":"IFERROR(VLOOKUP(AL5,Feiertage!$A$3:$B$29,2,FALSE),\"\")","v":""},{"$f":"IFERROR(VLOOKUP(AL5,Mondphasen!$G$23:$H$36,2,FALSE),\"\")","v":""},27,"2026-08-02",46236,{"$f":"AQ5","v":"2026-08-02"},{"$f":"IFERROR(VLOOKUP(AR5,Feiertage!$A$3:$B$29,2,FALSE),\"\")","v":""},{"$f":"IFERROR(VLOOKUP(AR5,Mondphasen!$G$23:$H$36,2,FALSE),\"\")","v":""},31,"2026-09-02",46267,{"$f":"AW5","v":"2026-09-02"},{"$f":"IFERROR(VLOOKUP(AX5,Feiertage!$A$3:$B$29,2,FALSE),\"\")","v":""},{"$f":"IFERROR(VLOOKUP(AX5,Mondphasen!$G$23:$H$36,2,FALSE),\"\")","v":""},36,"2026-10-02",46297,{"$f":"BC5","v":"2026-10-02"},{"$f":"IFERROR(VLOOKUP(BD5,Feiertage!$A$3:$B$29,2,FALSE),\"\")","v":""},{"$f":"IFERROR(VLOOKUP(BD5,Mondphasen!$G$23:$H$36,2,FALSE),\"\")","v":""},40,"2026-11-02",46328,{"$f":"BI5","v":"2026-11-02"},{"$f":"IFERROR(VLOOKUP(BJ5,Feiertage!$A$3:$B$29,2,FALSE),\"\")","v":""},{"$f":"IFERROR(VLOOKUP(BJ5,Mondphasen!$G$23:$H$36,2,FALSE),\"\")","v":""},45,"2026-12-02",46358,{"$f":"BO5","v":"2026-12-02"},{"$f":"IFERROR(VLOOKUP(BP5,Feiertage!$A$3:$B$29,2,FALSE),\"\")","v":""},{"$f":"IFERROR(VLOOKUP(BP5,Mondphasen!$G$23:$H$36,2,FALSE),\"\")","v":""},{"$f":"IFERROR(WEEKNUM(BO5,21),\"\")","v":49}]
["2026-01-03",46025,"2026-01-03",{"$f":"IFERROR(VLOOKUP(B6,Feiertage!$A$3:$B$29,2,FALSE),\"\")","v":""},{"$f":"IFERROR(VLOOKUP(B6,Mondphasen!$G$23:$H$36,2,FALSE),\"\")","v":"l"},1,"2026-02-03",46056,"2026-02-03",{"$f":"IFERROR(VLOOKUP(H6,Feiertage!$A$3:$B$29,2,FALSE),\"\")","v":""},{"$f":"IFERROR(VLOOKUP(H6,Mondphasen!$G$23:$H$36,2,FALSE),\"\")","v":""},6,"2026-03-03",46084,"2026-03-03",{"$f":"IFERROR(VLOOKUP(N6,Feiertage!$A$3:$B$29,2,FALSE),\"\")","v":""},{"$f":"IFERROR(VLOOKUP(N6,Mondphasen!$G$23:$H$36,2,FALSE),\"\")","v":"l"},10,"2026-04-03",46115,"2026-04-03",{"$f":"IFERROR(VLOOKUP(T6,Feiertage!$A$3:$B$29,2,FALSE),\"\")","v":"Karfreitag"},{"$f":"IFERROR(VLOOKUP(T6,Mondphasen!$G$23:$H$36,2,FALSE),\"\")","v":""},14,"2026-05-03",46145,"2026-05-03",{"$f":"IFERROR(VLOOKUP(Z6,Feiertage!$A$3:$B$29,2,FALSE),\"\")","v":""},{"$f":"IFERROR(VLOOKUP(Z6,Mondphasen!$G$23:$H$36,2,FALSE),\"\")","v":""},18,"2026-06-03",46176,"2026-06-03",{"$f":"IFERROR(VLOOKUP(AF6,Feiertage!$A$3:$B$29,2,FALSE),\"\")","v":""},{"$f":"IFERROR(VLOOKUP(AF6,Mondphasen!$G$23:$H$36,2,FALSE),\"\")","v":""},23,"2026-07-03",46206,"2026-07-03",{"$f":"IFERROR(VLOOKUP(AL6,Feiertage!$A$3:$B$29,2,FALSE),\"\")","v":""},{"$f":"IFERROR(VLOOKUP(AL6,Mondphasen!$G$23:$H$36,2,FALSE),\"\")","v":""},27,"2026-08-03",46237,"2026-08-03",{"$f":"IFERROR(VLOOKUP(AR6,Feiertage!$A$3:$B$29,2,FALSE),\"\")","v":""},{"$f":"IFERROR(VLOOKUP(AR6,Mondphasen!$G$23:$H$36,2,FALSE),\"\")","v":""},32,"2026-09-03",46268,"2026-09-03",{"$f":"IFERROR(VLOOKUP(AX6,Feiertage!$A$3:$B$29,2,FALSE),\"\")","v":""},{"$f":"IFERROR(VLOOKUP(AX6,Mondphasen!$G$23:$H$36,2,FALSE),\"\")","v":""},36,"2026-10-03",46298,"2026-10-03",{"$f":"IFERROR(VLOOKUP(BD6,Feiertage!$A$3:$B$29,2,FALSE),\"\")","v":""},{"$f":"IFERROR(VLOOKUP(BD6,Mondphasen!$G$23:$H$36,2,FALSE),\"\")","v":""},40,"2026-11-03",46329,"2026-11-03",{"$f":"IFERROR(VLOOKUP(BJ6,Feiertage!$A$3:$B$29,2,FALSE),\"\")","v":""},{"$f":"IFERROR(VLOOKUP(BJ6,Mondphasen!$G$23:$H$36,2,FALSE),\"\")","v":""},45,"2026-12-03",46359,"2026-12-03",{"$f":"IFERROR(VLOOKUP(BP6,Feiertage!$A$3:$B$29,2,FALSE),\"\")","v":""},{"$f":"IFERROR(VLOOKUP(BP6,Mondphasen!$G$23:$H$36,2,FALSE),\"\")","v":""},49]
["2026-01-04",46026,"2026-01-04",{"$f":"IFERROR(VLOOKUP(B7,Feiertage!$A$3:$B$29,2,FALSE),\"\")","v":""},{"$f":"IFERROR(VLOOKUP(B7,Mondphasen!$G$23:$H$36,2,FALSE),\"\")","v":""},1,"2026-02-04",46057,"2026-02-04",{"$f":"IFERROR(VLOOKUP(H7,Feiertage!$A$3:$B$29,2,FALSE),\"\")","v":""},{"$f":"IFERROR(VLOOKUP(H7,Mondphasen!$G$23:$H$36,2,FALSE),\"\")","v":""},6,"2026-03-04",46085,"2026-03-04",{"$f":"IFERROR(VLOOKUP(N7,Feiertage!$A$3:$B$29,2,FALSE),\"\")","v":""},{"$f":"IFERROR(VLOOKUP(N7,Mondphasen!$G$23:$H$36,2,FALSE),\"\")","v":""},10,"2026-04-04",46116,"2026-04-04",{"$f":"IFERROR(VLOOKUP(T7,Feiertage!$A$3:$B$29,2,FALSE),\"\")","v":""},{"$f":"IFERROR(VLOOKUP(T7,Mondphasen!$G$23:$H$36,2,FALSE),\"\")","v":""},14,"2026-05-04",46146,"2026-05-04",{"$f":"IFERROR(VLOOKUP(Z7,Feiertage!$A$3:$B$29,2,FALSE),\"\")","v":""},{"$f":"IFERROR(VLOOKUP(Z7,Mondphasen!$G$23:$H$36,2,FALSE),\"\")","v":""},19,"2026-06-04",46177,"2026-06-04",{"$f":"IFERROR(VLOOKUP(AF7,Feiertage!$A$3:$B$29,2,FALSE),\"\")","v":"Fronleichnam"},{"$f":"IFERROR(VLOOKUP(AF7,Mondphasen!$G$23:$H$36,2,FALSE),\"\")","v":""},23,"2026-07-04",46207,"2026-07-04",{"$f":"IFERROR(VLOOKUP(AL7,Feiertage!$A$3:$B$29,2,FALSE),\"\")","v":""},{"$f":"IFERROR(VLOOKUP(AL7,Mondphasen!$G$23:$H$36,2,FALSE),\"\")","v":""},27,"2026-08-04",46238,"2026-08-04",{"$f":"IFERROR(VLOOKUP(AR7,Feiertage!$A$3:$B$29,2,FALSE),\"\")","v":""},{"$f":"IFERROR(VLOOKUP(AR7,Mondphasen!$G$23:$H$36,2,FALSE),\"\")","v":""},32,"2026-09-04",46269,"2026-09-04",{"$f":"IFERROR(VLOOKUP(AX7,Feiertage!$A$3:$B$29,2,FALSE),\"\")","v":""},{"$f":"IFERROR(VLOOKUP(AX7,Mondphasen!$G$23:$H$36,2,FALSE),\"\")","v":""},36,"2026-10-04",46299,"2026-10-04",{"$f":"IFERROR(VLOOKUP(BD7,Feiertage!$A$3:$B$29,2,FALSE),\"\")","v":""},{"$f":"IFERROR(VLOOKUP(BD7,Mondphasen!$G$23:$H$36,2,FALSE),\"\")","v":""},40,"2026-11-04",46330,"2026-11-04",{"$f":"IFERROR(VLOOKUP(BJ7,Feiertage!$A$3:$B$29,2,FALSE),\"\")","v":""},{"$f":"IFERROR(VLOOKUP(BJ7,Mondphasen!$G$23:$H$36,2,FALSE),\"\")","v":""},45,"2026-12-04",46360,"2026-12-04",{"$f":"IFERROR(VLOOKUP(BP7,Feiertage!$A$3:$B$29,2,FALSE),\"\")","v":""},{"$f":"IFERROR(VLOOKUP(BP7,Mondphasen!$G$23:$H$36,2,FALSE),\"\")","v":""},49]
["2026-01-05",46027,"2026-01-05",{"$f":"IFERROR(VLOOKUP(B8,Feiertage!$A$3:$B$29,2,FALSE),\"\")","v":""},{"$f":"IFERROR(VLOOKUP(B8,Mondphasen!$G$23:$H$36,2,FALSE),\"\")","v":""},2,"2026-02-05",46058,"2026-02-05",{"$f":"IFERROR(VLOOKUP(H8,Feiertage!$A$3:$B$29,2,FALSE),\"\")","v":""},{"$f":"IFERROR(VLOOKUP(H8,Mondphasen!$G$23:$H$36,2,FALSE),\"\")","v":""},6,"2026-03-05",46086,"2026-03-05",{"$f":"IFERROR(VLOOKUP(N8,Feiertage!$A$3:$B$29,2,FALSE),\"\")","v":""},{"$f":"IFERROR(VLOOKUP(N8,Mondphasen!$G$23:$H$36,2,FALSE),\"\")","v":""},10,"2026-04-05",46117,"2026-04-05",{"$f":"IFERROR(VLOOKUP(T8,Feiertage!$A$3:$B$29,2,FALSE),\"\")","v":"Ostersonntag"},{"$f":"IFERROR(VLOOKUP(T8,Mondphasen!$G$23:$H$36,2,FALSE),\"\")","v":""},14,"2026-05-05",46147,"2026-05-05",{"$f":"IFERROR(VLOOKUP(Z8,Feiertage!$A$3:$B$29,2,FALSE),\"\")","v":""},{"$f":"IFERROR(VLOOKUP(Z8,Mondphasen!$G$23:$H$36,2,FALSE),\"\")","v":""},19,"2026-06-05",46178,"2026-06-05",{"$f":"IFERROR(VLOOKUP(AF8,Feiertage!$A$3:$B$29,2,FALSE),\"\")","v":""},{"$f":"IFERROR(VLOOKUP(AF8,Mondphasen!$G$23:$H$36,2,FALSE),\"\")","v":""},23,"2026-07-05",46208,"2026-07-05",{"$f":"IFERROR(VLOOKUP(AL8,Feiertage!$A$3:$B$29,2,FALSE),\"\")","v":""},{"$f":"IFERROR(VLOOKUP(AL8,Mondphasen!$G$23:$H$36,2,FALSE),\"\")","v":""},27,"2026-08-05",46239,"2026-08-05",{"$f":"IFERROR(VLOOKUP(AR8,Feiertage!$A$3:$B$29,2,FALSE),\"\")","v":""},{"$f":"IFERROR(VLOOKUP(AR8,Mondphasen!$G$23:$H$36,2,FALSE),\"\")","v":""},32,"2026-09-05",46270,"2026-09-05",{"$f":"IFERROR(VLOOKUP(AX8,Feiertage!$A$3:$B$29,2,FALSE),\"\")","v":""},{"$f":"IFERROR(VLOOKUP(AX8,Mondphasen!$G$23:$H$36,2,FALSE),\"\")","v":""},36,"2026-10-05",46300,"2026-10-05",{"$f":"IFERROR(VLOOKUP(BD8,Feiertage!$A$3:$B$29,2,FALSE),\"\")","v":""},{"$f":"IFERROR(VLOOKUP(BD8,Mondphasen!$G$23:$H$36,2,FALSE),\"\")","v":""},41,"2026-11-05",46331,"2026-11-05",{"$f":"IFERROR(VLOOKUP(BJ8,Feiertage!$A$3:$B$29,2,FALSE),\"\")","v":""},{"$f":"IFERROR(VLOOKUP(BJ8,Mondphasen!$G$23:$H$36,2,FALSE),\"\")","v":""},45,"2026-12-05",46361,"2026-12-05",{"$f":"IFERROR(VLOOKUP(BP8,Feiertage!$A$3:$B$29,2,FALSE),\"\")","v":""},{"$f":"IFERROR(VLOOKUP(BP8,Mondphasen!$G$23:$H$36,2,FALSE),\"\")","v":""},49]
{"$rows_left_out":27}
{"sheet":"Feiertage","index":1,"n_rows":29,"n_cols":16,"rows_kept":29,"cut":false,"hidden":false,"merged":[[1,1,1,3]]}
[{"$f":"IF(COUNTIF($P$3:$P$28,$A$2),\"Schaltjahr\",\"\")","v":""}]
[{"$f":"YEAR(Kalender!A4)","v":2026},{"$f":"A2","v":2026},null,null,"Gesetzlicher\nFeiertag",null,null,null,null,null,null,null,null,null,null,"Schaltjahre"]
[null,null,null,null,null,null,null,null,null,null,null,null,null,null,null,2020]
[{"$f":"C4","v":46023},"Neujahr",{"$f":"DATE(B2,1,1)","v":"2026-01-01"},{"$f":"WEEKDAY(C4,1)","v":"1900-01-05"},"Ja",null,{"$f":"I4","v":46023},"Neujahr",{"$f":"DATE($B$2,1,1)","v":"2026-01-01"},{"$f":"WEEKDAY(I4,1)","v":"1900-01-05"},"Ja",null,null,null,null,{"$f":"P3+4","v":2024}]
[46024,"Berchtoldstag",{"$f":"DATE(B2,1,2)","v":"2026-01-02"},"1900-01-06","Ja",null,46024,"Berchtoldstag",{"$f":"DATE($B$2,1,2)","v":"2026-01-02"},"1900-01-06","Ja",null,null,null,null,{"$f":"P4+4","v":2028}]
[46028,"Heilige drei Könige",{"$f":"DATE(B2,1,6)","v":"2026-01-06"},"1900-01-03",null,null,null,null,null,null,null,null,null,null,null,2032]
[46069,"Fasnacht-Montag",{"$f":"C13-48","v":"2026-02-16"},"1900-01-02",null,null,null,null,null,null,null,null,null,null,null,2036]
[46070,"Fasnacht-Dienstag",{"$f":"C13-47","v":"2026-02-17"},"1900-01-03",null,null,null,null,null,null,null,null,null,null,null,2040]
{"$rows_left_out":22}
{"sheet":"Mondphasen","index":2,"n_rows":36,"n_cols":14,"rows_kept":36,"cut":false,"hidden":false,"merged":[]}
["Jahr : ",{"$f":"Kalender!L1","v":2026}]
["Zeitzone : ",2]
[]
["Neumond"," erstes Viertel","Vollmond","letztes Viertel"]
[{"$f":"Tabelle!H1-2415018.5+Mondphasen!$B$2/24","v":"2025-12-20T03:44:35.240"},{"$f":"Tabelle!H2-2415018.5+Mondphasen!$B$2/24","v":"2025-12-27T21:11:06.544"},{"$f":"Tabelle!H3-2415018.5+Mondphasen!$B$2/24","v":"2026-01-03T12:03:54.095"},{"$f":"Tabelle!H4-2415018.5+Mondphasen!$B$2/24","v":"2026-01-10T17:49:10.327"}]
[{"$f":"Tabelle!H5-2415018.5+Mondphasen!$B$2/24","v":"2026-01-18T21:53:38.343"},{"$f":"Tabelle!H6-2415018.5+Mondphasen!$B$2/24","v":"2026-01-26T06:49:53.353"},{"$f":"Tabelle!H7-2415018.5+Mondphasen!$B$2/24","v":"2026-02-02T00:10:58.065"},{"$f":"Tabelle!H8-2415018.5+Mondphasen!$B$2/24","v":"2026-02-09T14:43:19.490"}]
[{"$f":"Tabelle!H9-2415018.5+Mondphasen!$B$2/24","v":"2026-02-17T14:02:56.538"},{"$f":"Tabelle!H10-2415018.5+Mondphasen!$B$2/24","v":"2026-02-24T14:30:23.590"},{"$f":"Tabelle!H11-2415018.5+Mondphasen!$B$2/24","v":"2026-03-03T13:40:13.285"},{"$f":"Tabelle!H12-2415018.5+Mondphasen!$B$2/24","v":"2026-03-11T11:40:09.350"}]
[{"$f":"Tabelle!H13-2415018.5+Mondphasen!$B$2/24","v":"2026-03-19T03:25:55.556"},{"$f":"Tabelle!H14-2415018.5+Mondphasen!$B$2/24","v":"2026-03-25T21:19:28.492"},{"$f":"Tabelle!H15-2415018.5+Mondphasen!$B$2/24","v":"2026-04-02T04:14:14.472"},{"$f":"Tabelle!H16-2415018.5+Mondphasen!$B$2/24","v":"2026-04-10T06:54:14.789"}]
{"$rows_left_out":29}
{"sheet":"Tabelle","index":3,"n_rows":56,"n_cols":8,"rows_kept":56,"cut":false,"hidden":false,"merged":[]}
[{"$f":"Mondphasen!B1","v":2026},0,{"$f":"INT((A1-2000)*12.3685)+B1","v":321},{"$f":"2451550.09766+29.530588861*C1","v":2461029.4166843812},{"$f":"(2.5534+29.1053567*C1)*PI()/180","v":163.10752694386812},{"$f":"(201.5643+385.81693528*C1)*PI()/180","v":2165.0600023088264},{"$f":"(160.7108+390.67050284*C1)*PI()/180","v":2191.5391199620481},{"$f":"-0.4072*SIN(F1)+0.17241*SIN(E1)+0.01608*SIN(2*F1)+0.01039*SIN(2*G1)+0.00739*SIN(F1-E1)-0.00514*SIN(F1+E1)+0.00208*SIN(2*E1)-0.00111*SIN(F1-2*G1)+D1","v":2461029.5726300906}]
[{"$f":"A1","v":2026},0.25,321.25,2461036.7993315961,163.23452301996372,2166.7434462664737,2193.2437416032935,{"$f":"-0.62801*SIN(F2)+0.17172*SIN(E2)-0.01183*SIN(F2+E2)+0.00862*SIN(2*F2)+0.00804*SIN(2*G2)+0.00454*SIN(F2-E2)+0.00204*SIN(2*E2)-0.0018*SIN(F2-2*G2)+D2+0.00306","v":2461037.2993812971}]
[{"$f":"A2","v":2026},0.5,321.5,2461044.1819788115,163.36151909605931,2168.4268902241211,2194.9483632445381,{"$f":"-0.40614*SIN(F3)+0.17302*SIN(E3)+0.01614*SIN(2*F3)+0.01043*SIN(2*G3)+0.00734*SIN(F3-E3)-0.00515*SIN(F3+E3)+0.00209*SIN(2*E3)-0.00111*SIN(F3-2*G3)+D3","v":2461043.9193761051}]
[{"$f":"A3","v":2026},0.75,321.75,2461051.5646260269,163.48851517215488,2170.1103341817684,2196.6529848857831,{"$f":"-0.62801*SIN(F4)+0.17172*SIN(E4)-0.01183*SIN(F4+E4)+0.00862*SIN(2*F4)+0.00804*SIN(2*G4)+0.00454*SIN(F4-E4)+0.00204*SIN(2*E4)-0.0018*SIN(F4-2*G4)+D4-0.00306","v":2461051.1591473068}]
[{"$f":"A1+0.08","v":2026.08},0,322,2461058.9472732418,163.6155112482505,2171.7937781394157,2198.3576065270281,{"$f":"-0.4072*SIN(F5)+0.17241*SIN(E5)+0.01608*SIN(2*F5)+0.01039*SIN(2*G5)+0.00739*SIN(F5-E5)-0.00514*SIN(F5+E5)+0.00208*SIN(2*E5)-0.00111*SIN(F5-2*G5)+D5","v":2461059.3289160072}]
[{"$f":"A5","v":2026.08},0.25,322.25,2461066.3299204572,163.74250732434609,2173.4772220970631,2200.0622281682731,{"$f":"-0.62801*SIN(F6)+0.17172*SIN(E6)-0.01183*SIN(F6+E6)+0.00862*SIN(2*F6)+0.00804*SIN(2*G6)+0.00454*SIN(F6-E6)+0.00204*SIN(2*E6)-0.0018*SIN(F6-2*G6)+D6+0.00306","v":2461066.7013119524}]
[{"$f":"A6","v":2026.08},0.5,322.5,2461073.7125676726,163.86950340044169,2175.1606660547109,2201.7668498095181,{"$f":"-0.40614*SIN(F7)+0.17302*SIN(E7)+0.01614*SIN(2*F7)+0.01043*SIN(2*G7)+0.00734*SIN(F7-E7)-0.00515*SIN(F7+E7)+0.00209*SIN(2*E7)-0.00111*SIN(F7-2*G7)+D7","v":2461073.4242831636}]
[{"$f":"A7","v":2026.08},0.75,322.75,2461081.0952148875,163.99649947653728,2176.8441100123582,2203.4714714507631,{"$f":"-0.62801*SIN(F8)+0.17172*SIN(E8)-0.01183*SIN(F8+E8)+0.00862*SIN(2*F8)+0.00804*SIN(2*G8)+0.00454*SIN(F8-E8)+0.00204*SIN(2*E8)-0.0018*SIN(F8-2*G8)+D8-0.00306","v":2461081.0300866887}]
{"$rows_left_out":48}